{"text_format":"1","workbook":"xlsx","n_sheets":5,"sheets":["KORADO","Databáze","výkony","vstupy","logic"],"not_rendered":{"charts":0,"images":17,"macros":1,"external_links":0,"defined_names":50,"comments":0,"pivot_tables":0},"unopened":[],"bounds":{"document_bytes":16777216,"sheet_cells":100000,"rows_first":2000,"rows_last":500,"rows_between":2000,"halvings":0,"cell_chars":16384,"cell_head_chars":4096},"cells_cut":0,"cells_raw":0,"read":"whole","date_system":"1900"}

{"sheet":"KORADO","index":0,"n_rows":80,"n_cols":30,"rows_kept":80,"cut":false,"hidden":false,"merged":[[7,15,8,15],[7,16,8,16]]}
[]
[null,null,{"$f":"logic!P4","v":"Teplota:"},null,null,null,null,{"$f":"logic!R4","v":"Detailní výběr"}]
[null,null,"t 1","t 2","t i"," D T",null,null,null,{"$f":"logic!O4&\" \"&logic!M4","v":"Tepelný výkon od"},null,{"$f":"logic!C45& \" \"&logic!N4","v":"W do"},null,{"$f":"logic!C45","v":"W"}]
[null,null,75,65,20,{"$f":"(C4+D4)/2-E4","v":50},null,null,null,{"$f":"logic!K4&\" \"&logic!M4","v":"Výška od"},{"$f":"logic!B24","v":"vše"},{"$f":"\"mm \"&logic!$N$4","v":"mm do"},{"$f":"logic!B34","v":"vše"}," mm"]
[null,null,{"$f":"logic!J4","v":"Tepelné výkony podle EN 442"},null,null,null,null,null,null,{"$f":"logic!L4&\" \"&logic!M4","v":"Délka od"},{"$f":"logic!B4","v":"vše"},{"$f":"\"mm \"&logic!$N$4","v":"mm do"},{"$f":"logic!B14","v":"vše"}," mm"]
[null,null,{"$f":"IF(OR(C4<7,D4<6,C4>110,D4>110,C4<=D4,F4<=0,E4<4,E4>40.5),logic!Q4,0)","v":0}]
[null,null,{"$f":"logic!$AB$4","v":"Provedení"},null,{"$f":"logic!$AC$4","v":"Povrchová úprava"},null,null,{"$f":"logic!U4","v":"Způsob připojení"}]
[null,null,{"$f":"logic!B99","v":"LINEAR"},null,{"$f":"logic!B105","v":"BARVA"},null,null,{"$f":"lblZpusobPripojeni","v":"spodní zdola dolů"},null,null,null,null,null,null,null,{"$f":"logic!L24","v":"Počet záznamů v databázi:"},{"$f":"MAX(Databáze!A:A)","v":0}]
[]
[]
[]
[null,null,null,{"$f":"IF(AND($K$4=logic!$I$4,$M$4=logic!$I$4),1,IF(D15=$K$4,1,0))","v":1},{"$f":"IF(AND($K$4=logic!$I$4,$M$4=logic!$I$4),1,IF(AND(E15>=$K$4,E15<=$M$4),1,0))","v":1},{"$f":"IF(AND($K$4=logic!$I$4,$M$4=logic!$I$4),1,IF(AND(F15>=$K$4,F15<=$M$4),1,0))","v":1},{"$f":"IF(AND($K$4=logic!$I$4,$M$4=logic!$I$4),1,IF(AND(G15>=$K$4,G15<=$M$4),1,0))","v":1},{"$f":"IF(AND($K$4=logic!$I$4,$M$4=logic!$I$4),1,IF(AND(H15>=$K$4,H15<=$M$4),1,0))","v":1},{"$f":"IF(logic!$A$51=2,0,IF(AND($K$4=logic!$I$4,$M$4=logic!$I$4),1,IF(I15=$K$4,1,0)))","v":1},{"$f":"IF(logic!$A$51=2,0,IF(AND($K$4=logic!$I$4,$M$4=logic!$I$4),1,IF(AND(E15>=$K$4,E15<=$M$4),1,0)))","v":1},{"$f":"IF(logic!$A$51=2,0,IF(AND($K$4=logic!$I$4,$M$4=logic!$I$4),1,IF(AND(F15>=$K$4,F15<=$M$4),1,0)))","v":1},{"$f":"IF(logic!$A$51=2,0,IF(AND($K$4=logic!$I$4,$M$4=logic!$I$4),1,IF(AND(G15>=$K$4,G15<=$M$4),1,0)))","v":1},{"$f":"IF(logic!$A$51=2,0,IF(AND($K$4=logic!$I$4,$M$4=logic!$I$4),1,IF(AND(H15>=$K$4,H15<=$M$4),1,0)))","v":1}]
[null,null,null,"KORALUX LINEAR MAX",null,null,null,null,"KORALUX LINEAR MAX - M",null,null,null,null,null,null,null,null,null,null,"KORALUX LINEAR MAX",null,null,null,null,"KORALUX LINEAR MAX - M"]
[null,null,{"$f":"logic!$L$4","v":"Délka"},{"$f":"logic!$K$4&\" H [mm]\"","v":"Výška H [mm]"},null,null,null,null,{"$f":"logic!$K$4&\" H [mm]\"","v":"Výška H [mm]"},null,null,null,null,{"$f":"logic!$L$4","v":"Délka"},null,null,null,null,{"$f":"logic!$L$4","v":"Délka"},{"$f":"logic!$K$4&\" H [mm]\"","v":"Výška H [mm]"},null,null,null,null,{"$f":"logic!$K$4&\" H [mm]\"","v":"Výška H [mm]"},null,null,null,null,{"$f":"logic!$L$4","v":"Délka"}]
[null,null,"L [mm]",700,900,1220,1500,1820,700,900,1220,1500,1820,"L [mm]",null,null,null,null,"L [mm]",700,900,1220,1500,1820,700,900,1220,1500,1820,"L [mm]"]
[null,{"$f":"IF(AND($K$5=logic!$I$4,$M$5=logic!$I$4),1,IF(AND(C16>=$K$5,C16<=$M$5),1,0))","v":1},450,{"$f":"IF(OR(D$12=0,$B16=0),0,IF(logic!$A$51=1,výkony!C15,výkony!P15))","v":320},{"$f":"IF(OR(E$12=0,$B16=0),0,IF(logic!$A$51=1,výkony!D15,výkony!Q15))","v":411},{"$f":"IF(OR(F$12=0,$B16=0),0,IF(logic!$A$51=1,výkony!E15,výkony!R15))","v":557},{"$f":"IF(OR(G$12=0,$B16=0),0,IF(logic!$A$51=1,výkony!F15,výkony!S15))","v":686},{"$f":"IF(OR(H$12=0,$B16=0),0,IF(logic!$A$51=1,výkony!G15,výkony!T15))","v":833},{"$f":"IF(OR(I$12=0,$B16=0),0,IF(logic!$A$51=1,výkony!H15,výkony!U15))","v":320},{"$f":"IF(OR(J$12=0,$B16=0),0,IF(logic!$A$51=1,výkony!I15,výkony!V15))","v":411},{"$f":"IF(OR(K$12=0,$B16=0),0,IF(logic!$A$51=1,výkony!J15,výkony!W15))","v":557},{"$f":"IF(OR(L$12=0,$B16=0),0,IF(logic!$A$51=1,výkony!K15,výkony!X15))","v":686},{"$f":"IF(OR(M$12=0,$B16=0),0,IF(logic!$A$51=1,výkony!L15,výkony!Y15))","v":833},450,null,null,null,null,450,{"$f":"\"KLM-\"&IF(LEN(T$15)=3,\"0\"&T$15/10,T$15/10)&\"0\"&$S16/10&\"-00-10\"","v":"KLM-070045-00-10"},{"$f":"\"KLM-\"&IF(LEN(U$15)=3,\"0\"&U$15/10,U$15/10)&\"0\"&$S16/10&\"-00-10\"","v":"KLM-090045-00-10"},"KLM-122045-00-10","KLM-150045-00-10","KLM-182045-00-10",{"$f":"\"KLM-\"&IF(LEN(Y$15)=3,\"0\"&Y$15/10,Y$15/10)&\"0\"&$S16/10&\"-00M10\"","v":"KLM-070045-00M10"},{"$f":"\"KLM-\"&IF(LEN(Z$15)=3,\"0\"&Z$15/10,Z$15/10)&\"0\"&$S16/10&\"-00M10\"","v":"KLM-090045-00M10"},"KLM-122045-00M10","KLM-150045-00M10","KLM-182045-00M10",450]
[null,{"$f":"IF(AND($K$5=logic!$I$4,$M$5=logic!$I$4),1,IF(AND(C17>=$K$5,C17<=$M$5),1,0))","v":1},600,{"$f":"IF(OR(D$12=0,$B17=0),0,IF(logic!$A$51=1,výkony!C16,výkony!P16))","v":422},{"$f":"IF(OR(E$12=0,$B17=0),0,IF(logic!$A$51=1,výkony!D16,výkony!Q16))","v":543},{"$f":"IF(OR(F$12=0,$B17=0),0,IF(logic!$A$51=1,výkony!E16,výkony!R16))","v":736},{"$f":"IF(OR(G$12=0,$B17=0),0,IF(logic!$A$51=1,výkony!F16,výkony!S16))","v":906},{"$f":"IF(OR(H$12=0,$B17=0),0,IF(logic!$A$51=1,výkony!G16,výkony!T16))","v":1101},{"$f":"IF(OR(I$12=0,$B17=0),0,IF(logic!$A$51=1,výkony!H16,výkony!U16))","v":422},{"$f":"IF(OR(J$12=0,$B17=0),0,IF(logic!$A$51=1,výkony!I16,výkony!V16))","v":543},{"$f":"IF(OR(K$12=0,$B17=0),0,IF(logic!$A$51=1,výkony!J16,výkony!W16))","v":736},{"$f":"IF(OR(L$12=0,$B17=0),0,IF(logic!$A$51=1,výkony!K16,výkony!X16))","v":906},{"$f":"IF(OR(M$12=0,$B17=0),0,IF(logic!$A$51=1,výkony!L16,výkony!Y16))","v":1101},600,null,null,null,null,600,{"$f":"\"KLM-\"&IF(LEN(T$15)=3,\"0\"&T$15/10,T$15/10)&\"0\"&$S17/10&\"-00-10\"","v":"KLM-070060-00-10"},"KLM-090060-00-10","KLM-122060-00-10","KLM-150060-00-10","KLM-182060-00-10",{"$f":"\"KLM-\"&IF(LEN(Y$15)=3,\"0\"&Y$15/10,Y$15/10)&\"0\"&$S17/10&\"-00M10\"","v":"KLM-070060-00M10"},"KLM-090060-00M10","KLM-122060-00M10","KLM-150060-00M10","KLM-182060-00M10",600]
[null,{"$f":"IF(AND($K$5=logic!$I$4,$M$5=logic!$I$4),1,IF(AND(C18>=$K$5,C18<=$M$5),1,0))","v":1},750,{"$f":"IF(OR(D$12=0,$B18=0),0,IF(logic!$A$51=1,výkony!C17,výkony!P17))","v":524},{"$f":"IF(OR(E$12=0,$B18=0),0,IF(logic!$A$51=1,výkony!D17,výkony!Q17))","v":673},{"$f":"IF(OR(F$12=0,$B18=0),0,IF(logic!$A$51=1,výkony!E17,výkony!R17))","v":913},{"$f":"IF(OR(G$12=0,$B18=0),0,IF(logic!$A$51=1,výkony!F17,výkony!S17))","v":1124},{"$f":"IF(OR(H$12=0,$B18=0),0,IF(logic!$A$51=1,výkony!G17,výkony!T17))","v":1367},{"$f":"IF(OR(I$12=0,$B18=0),0,IF(logic!$A$51=1,výkony!H17,výkony!U17))","v":524},{"$f":"IF(OR(J$12=0,$B18=0),0,IF(logic!$A$51=1,výkony!I17,výkony!V17))","v":673},{"$f":"IF(OR(K$12=0,$B18=0),0,IF(logic!$A$51=1,výkony!J17,výkony!W17))","v":913},{"$f":"IF(OR(L$12=0,$B18=0),0,IF(logic!$A$51=1,výkony!K17,výkony!X17))","v":1124},{"$f":"IF(OR(M$12=0,$B18=0),0,IF(logic!$A$51=1,výkony!L17,výkony!Y17))","v":1367},750,null,null,null,null,750,"KLM-070075-00-10","KLM-090075-00-10","KLM-122075-00-10","KLM-150075-00-10","KLM-182075-00-10","KLM-070075-00M10","KLM-090075-00M10","KLM-122075-00M10","KLM-150075-00M10","KLM-182075-00M10",750]
[]
[null,null,null,"KORALUX LINEAR COMFORT",null,null,null,null,"KORALUX LINEAR COMFORT - M",null,null,null,null,null,null,null,null,null,null,"KORALUX LINEAR COMFORT",null,null,null,null,"KORALUX LINEAR COMFORT - M"]
[null,null,{"$f":"logic!$L$4","v":"Délka"},{"$f":"logic!$K$4&\" H [mm]\"","v":"Výška H [mm]"},null,null,null,null,{"$f":"logic!$K$4&\" H [mm]\"","v":"Výška H [mm]"},null,null,null,null,{"$f":"logic!$L$4","v":"Délka"},null,null,null,null,{"$f":"logic!$L$4","v":"Délka"},{"$f":"logic!$K$4&\" H [mm]\"","v":"Výška H [mm]"},null,null,null,null,{"$f":"logic!$K$4&\" H [mm]\"","v":"Výška H [mm]"},null,null,null,null,{"$f":"logic!$L$4","v":"Délka"}]
[null,null,"L [mm]",700,900,1220,1500,1820,700,900,1220,1500,1820,"L [mm]",null,null,null,null,"L [mm]",700,900,1220,1500,1820,700,900,1220,1500,1820,"L [mm]"]
[null,{"$f":"IF(AND($K$5=logic!$I$4,$M$5=logic!$I$4),1,IF(AND(C23>=$K$5,C23<=$M$5),1,0))","v":1},450,{"$f":"IF(OR(D$12=0,$B23=0),0,IF(logic!$A$51=1,výkony!C22,výkony!P22))","v":287},{"$f":"IF(OR(E$12=0,$B23=0),0,IF(logic!$A$51=1,výkony!D22,výkony!Q22))","v":369},{"$f":"IF(OR(F$12=0,$B23=0),0,IF(logic!$A$51=1,výkony!E22,výkony!R22))","v":504},{"$f":"IF(OR(G$12=0,$B23=0),0,IF(logic!$A$51=1,výkony!F22,výkony!S22))","v":626},{"$f":"IF(OR(H$12=0,$B23=0),0,IF(logic!$A$51=1,výkony!G22,výkony!T22))","v":772},{"$f":"IF(OR(I$12=0,$B23=0),0,IF(logic!$A$51=1,výkony!H22,výkony!U22))","v":287},{"$f":"IF(OR(J$12=0,$B23=0),0,IF(logic!$A$51=1,výkony!I22,výkony!V22))","v":369},{"$f":"IF(OR(K$12=0,$B23=0),0,IF(logic!$A$51=1,výkony!J22,výkony!W22))","v":504},{"$f":"IF(OR(L$12=0,$B23=0),0,IF(logic!$A$51=1,výkony!K22,výkony!X22))","v":626},{"$f":"IF(OR(M$12=0,$B23=0),0,IF(logic!$A$51=1,výkony!L22,výkony!Y22))","v":772},450,null,null,null,null,450,{"$f":"\"KLT-\"&IF(LEN(T$22)=3,\"0\"&T$22/10,T$22/10)&\"0\"&$S23/10&\"-00-10\"","v":"KLT-070045-00-10"},{"$f":"\"KLT-\"&IF(LEN(U$22)=3,\"0\"&U$22/10,U$22/10)&\"0\"&$S23/10&\"-00-10\"","v":"KLT-090045-00-10"},"KLT-122045-00-10","KLT-150045-00-10","KLT-182045-00-10",{"$f":"\"KLT-\"&IF(LEN(Y$22)=3,\"0\"&Y$22/10,Y$22/10)&\"0\"&$S23/10&\"-00M10\"","v":"KLT-070045-00M10"},{"$f":"\"KLT-\"&IF(LEN(Z$22)=3,\"0\"&Z$22/10,Z$22/10)&\"0\"&$S23/10&\"-00M10\"","v":"KLT-090045-00M10"},"KLT-122045-00M10","KLT-150045-00M10","KLT-182045-00M10",450]
[null,{"$f":"IF(AND($K$5=logic!$I$4,$M$5=logic!$I$4),1,IF(AND(C24>=$K$5,C24<=$M$5),1,0))","v":1},500,{"$f":"IF(OR(D$12=0,$B24=0),0,IF(logic!$A$51=1,výkony!C23,výkony!P23))","v":315},{"$f":"IF(OR(E$12=0,$B24=0),0,IF(logic!$A$51=1,výkony!D23,výkony!Q23))","v":405},{"$f":"IF(OR(F$12=0,$B24=0),0,IF(logic!$A$51=1,výkony!E23,výkony!R23))","v":553},{"$f":"IF(OR(G$12=0,$B24=0),0,IF(logic!$A$51=1,výkony!F23,výkony!S23))","v":687},{"$f":"IF(OR(H$12=0,$B24=0),0,IF(logic!$A$51=1,výkony!G23,výkony!T23))","v":848},{"$f":"IF(OR(I$12=0,$B24=0),0,IF(logic!$A$51=1,výkony!H23,výkony!U23))","v":315},{"$f":"IF(OR(J$12=0,$B24=0),0,IF(logic!$A$51=1,výkony!I23,výkony!V23))","v":405},{"$f":"IF(OR(K$12=0,$B24=0),0,IF(logic!$A$51=1,výkony!J23,výkony!W23))","v":553},{"$f":"IF(OR(L$12=0,$B24=0),0,IF(logic!$A$51=1,výkony!K23,výkony!X23))","v":687},{"$f":"IF(OR(M$12=0,$B24=0),0,IF(logic!$A$51=1,výkony!L23,výkony!Y23))","v":848},500,null,null,null,null,500,{"$f":"\"KLT-\"&IF(LEN(T$22)=3,\"0\"&T$22/10,T$22/10)&\"0\"&$S24/10&\"-00-10\"","v":"KLT-070050-00-10"},"KLT-090050-00-10","KLT-122050-00-10","KLT-150050-00-10","KLT-182050-00-10",{"$f":"\"KLT-\"&IF(LEN(Y$22)=3,\"0\"&Y$22/10,Y$22/10)&\"0\"&$S24/10&\"-00M10\"","v":"KLT-070050-00M10"},"KLT-090050-00M10","KLT-122050-00M10","KLT-150050-00M10","KLT-182050-00M10",500]
[null,{"$f":"IF(AND($K$5=logic!$I$4,$M$5=logic!$I$4),1,IF(AND(C25>=$K$5,C25<=$M$5),1,0))","v":1},600,{"$f":"IF(OR(D$12=0,$B25=0),0,IF(logic!$A$51=1,výkony!C24,výkony!P24))","v":370},{"$f":"IF(OR(E$12=0,$B25=0),0,IF(logic!$A$51=1,výkony!D24,výkony!Q24))","v":475},{"$f":"IF(OR(F$12=0,$B25=0),0,IF(logic!$A$51=1,výkony!E24,výkony!R24))","v":650},{"$f":"IF(OR(G$12=0,$B25=0),0,IF(logic!$A$51=1,výkony!F24,výkony!S24))","v":808},{"$f":"IF(OR(H$12=0,$B25=0),0,IF(logic!$A$51=1,výkony!G24,výkony!T24))","v":996},{"$f":"IF(OR(I$12=0,$B25=0),0,IF(logic!$A$51=1,výkony!H24,výkony!U24))","v":370},{"$f":"IF(OR(J$12=0,$B25=0),0,IF(logic!$A$51=1,výkony!I24,výkony!V24))","v":475},{"$f":"IF(OR(K$12=0,$B25=0),0,IF(logic!$A$51=1,výkony!J24,výkony!W24))","v":650},{"$f":"IF(OR(L$12=0,$B25=0),0,IF(logic!$A$51=1,výkony!K24,výkony!X24))","v":808},{"$f":"IF(OR(M$12=0,$B25=0),0,IF(logic!$A$51=1,výkony!L24,výkony!Y24))","v":996},600,null,null,null,null,600,"KLT-070060-00-10","KLT-090060-00-10","KLT-122060-00-10","KLT-150060-00-10","KLT-182060-00-10","KLT-070060-00M10","KLT-090060-00M10","KLT-122060-00M10","KLT-150060-00M10","KLT-182060-00M10",600]
[null,{"$f":"IF(AND($K$5=logic!$I$4,$M$5=logic!$I$4),1,IF(AND(C26>=$K$5,C26<=$M$5),1,0))","v":1},750,{"$f":"IF(OR(D$12=0,$B26=0),0,IF(logic!$A$51=1,výkony!C25,výkony!P25))","v":450},{"$f":"IF(OR(E$12=0,$B26=0),0,IF(logic!$A$51=1,výkony!D25,výkony!Q25))","v":579},{"$f":"IF(OR(F$12=0,$B26=0),0,IF(logic!$A$51=1,výkony!E25,výkony!R25))","v":791},{"$f":"IF(OR(G$12=0,$B26=0),0,IF(logic!$A$51=1,výkony!F25,výkony!S25))","v":984},{"$f":"IF(OR(H$12=0,$B26=0),0,IF(logic!$A$51=1,výkony!G25,výkony!T25))","v":1213},{"$f":"IF(OR(I$12=0,$B26=0),0,IF(logic!$A$51=1,výkony!H25,výkony!U25))","v":450},{"$f":"IF(OR(J$12=0,$B26=0),0,IF(logic!$A$51=1,výkony!I25,výkony!V25))","v":579},{"$f":"IF(OR(K$12=0,$B26=0),0,IF(logic!$A$51=1,výkony!J25,výkony!W25))","v":791},{"$f":"IF(OR(L$12=0,$B26=0),0,IF(logic!$A$51=1,výkony!K25,výkony!X25))","v":984},{"$f":"IF(OR(M$12=0,$B26=0),0,IF(logic!$A$51=1,výkony!L25,výkony!Y25))","v":1213},750,null,null,null,null,750,"KLT-070075-00-10","KLT-090075-00-10","KLT-122075-00-10","KLT-150075-00-10","KLT-182075-00-10","KLT-070075-00M10","KLT-090075-00M10","KLT-122075-00M10","KLT-150075-00M10","KLT-182075-00M10",750]
[]
[null,null,null,"KORALUX LINEAR CLASSIC",null,null,null,null,"KORALUX LINEAR CLASSIC - M",null,null,null,null,null,null,null,null,null,null,"KORALUX LINEAR CLASSIC",null,null,null,null,"KORALUX LINEAR CLASSIC - M"]
[null,null,{"$f":"logic!$L$4","v":"Délka"},{"$f":"logic!$K$4&\" H [mm]\"","v":"Výška H [mm]"},null,null,null,null,{"$f":"logic!$K$4&\" H [mm]\"","v":"Výška H [mm]"},null,null,null,null,{"$f":"logic!$L$4","v":"Délka"},null,null,null,null,{"$f":"logic!$L$4","v":"Délka"},{"$f":"logic!$K$4&\" H [mm]\"","v":"Výška H [mm]"},null,null,null,null,{"$f":"logic!$K$4&\" H [mm]\"","v":"Výška H [mm]"},null,null,null,null,{"$f":"logic!$L$4","v":"Délka"}]
[null,null,"L [mm]",700,900,1220,1500,1820,700,900,1220,1500,1820,"L [mm]",null,null,null,null,"L [mm]",700,900,1220,1500,1820,700,900,1220,1500,1820,"L [mm]"]
[null,{"$f":"IF(AND($K$5=logic!$I$4,$M$5=logic!$I$4),1,IF(AND(C31>=$K$5,C31<=$M$5),1,0))","v":1},450,{"$f":"IF(OR(D$12=0,$B31=0),0,IF(logic!$A$51=1,výkony!C30,výkony!P30))","v":255},{"$f":"IF(OR(E$12=0,$B31=0),0,IF(logic!$A$51=1,výkony!D30,výkony!Q30))","v":333},{"$f":"IF(OR(F$12=0,$B31=0),0,IF(logic!$A$51=1,výkony!E30,výkony!R30))","v":462},{"$f":"IF(OR(G$12=0,$B31=0),0,IF(logic!$A$51=1,výkony!F30,výkony!S30))","v":581},{"$f":"IF(OR(H$12=0,$B31=0),0,IF(logic!$A$51=1,výkony!G30,výkony!T30))","v":725},{"$f":"IF(OR(I$12=0,$B31=0),0,IF(logic!$A$51=1,výkony!H30,výkony!U30))","v":255},{"$f":"IF(OR(J$12=0,$B31=0),0,IF(logic!$A$51=1,výkony!I30,výkony!V30))","v":333},{"$f":"IF(OR(K$12=0,$B31=0),0,IF(logic!$A$51=1,výkony!J30,výkony!W30))","v":462},{"$f":"IF(OR(L$12=0,$B31=0),0,IF(logic!$A$51=1,výkony!K30,výkony!X30))","v":581},{"$f":"IF(OR(M$12=0,$B31=0),0,IF(logic!$A$51=1,výkony!L30,výkony!Y30))","v":725},450,null,null,null,null,450,{"$f":"\"KLC-\"&IF(LEN(T$30)=3,\"0\"&T$30/10,T$30/10)&\"0\"&$S31/10&\"-00-10\"","v":"KLC-070045-00-10"},{"$f":"\"KLC-\"&IF(LEN(U$30)=3,\"0\"&U$30/10,U$30/10)&\"0\"&$S31/10&\"-00-10\"","v":"KLC-090045-00-10"},"KLC-122045-00-10","KLC-150045-00-10","KLC-182045-00-10",{"$f":"\"KLC-\"&IF(LEN(Y$30)=3,\"0\"&Y$30/10,Y$30/10)&\"0\"&$S31/10&\"-00M10\"","v":"KLC-070045-00M10"},{"$f":"\"KLC-\"&IF(LEN(Z$30)=3,\"0\"&Z$30/10,Z$30/10)&\"0\"&$S31/10&\"-00M10\"","v":"KLC-090045-00M10"},"KLC-122045-00M10","KLC-150045-00M10","KLC-182045-00M10",450]
[null,{"$f":"IF(AND($K$5=logic!$I$4,$M$5=logic!$I$4),1,IF(AND(C32>=$K$5,C32<=$M$5),1,0))","v":1},500,{"$f":"IF(OR(D$12=0,$B32=0),0,IF(logic!$A$51=1,výkony!C31,výkony!P31))","v":280},{"$f":"IF(OR(E$12=0,$B32=0),0,IF(logic!$A$51=1,výkony!D31,výkony!Q31))","v":365},{"$f":"IF(OR(F$12=0,$B32=0),0,IF(logic!$A$51=1,výkony!E31,výkony!R31))","v":507},{"$f":"IF(OR(G$12=0,$B32=0),0,IF(logic!$A$51=1,výkony!F31,výkony!S31))","v":638},{"$f":"IF(OR(H$12=0,$B32=0),0,IF(logic!$A$51=1,výkony!G31,výkony!T31))","v":795},{"$f":"IF(OR(I$12=0,$B32=0),0,IF(logic!$A$51=1,výkony!H31,výkony!U31))","v":280},{"$f":"IF(OR(J$12=0,$B32=0),0,IF(logic!$A$51=1,výkony!I31,výkony!V31))","v":365},{"$f":"IF(OR(K$12=0,$B32=0),0,IF(logic!$A$51=1,výkony!J31,výkony!W31))","v":507},{"$f":"IF(OR(L$12=0,$B32=0),0,IF(logic!$A$51=1,výkony!K31,výkony!X31))","v":638},{"$f":"IF(OR(M$12=0,$B32=0),0,IF(logic!$A$51=1,výkony!L31,výkony!Y31))","v":795},500,null,null,null,null,500,{"$f":"\"KLC-\"&IF(LEN(T$30)=3,\"0\"&T$30/10,T$30/10)&\"0\"&$S32/10&\"-00-10\"","v":"KLC-070050-00-10"},"KLC-090050-00-10","KLC-122050-00-10","KLC-150050-00-10","KLC-182050-00-10",{"$f":"\"KLC-\"&IF(LEN(Y$30)=3,\"0\"&Y$30/10,Y$30/10)&\"0\"&$S32/10&\"-00M10\"","v":"KLC-070050-00M10"},"KLC-090050-00M10","KLC-122050-00M10","KLC-150050-00M10","KLC-182050-00M10",500]
[null,{"$f":"IF(AND($K$5=logic!$I$4,$M$5=logic!$I$4),1,IF(AND(C33>=$K$5,C33<=$M$5),1,0))","v":1},600,{"$f":"IF(OR(D$12=0,$B33=0),0,IF(logic!$A$51=1,výkony!C32,výkony!P32))","v":329},{"$f":"IF(OR(E$12=0,$B33=0),0,IF(logic!$A$51=1,výkony!D32,výkony!Q32))","v":429},{"$f":"IF(OR(F$12=0,$B33=0),0,IF(logic!$A$51=1,výkony!E32,výkony!R32))","v":596},{"$f":"IF(OR(G$12=0,$B33=0),0,IF(logic!$A$51=1,výkony!F32,výkony!S32))","v":750},{"$f":"IF(OR(H$12=0,$B33=0),0,IF(logic!$A$51=1,výkony!G32,výkony!T32))","v":934},{"$f":"IF(OR(I$12=0,$B33=0),0,IF(logic!$A$51=1,výkony!H32,výkony!U32))","v":329},{"$f":"IF(OR(J$12=0,$B33=0),0,IF(logic!$A$51=1,výkony!I32,výkony!V32))","v":429},{"$f":"IF(OR(K$12=0,$B33=0),0,IF(logic!$A$51=1,výkony!J32,výkony!W32))","v":596},{"$f":"IF(OR(L$12=0,$B33=0),0,IF(logic!$A$51=1,výkony!K32,výkony!X32))","v":750},{"$f":"IF(OR(M$12=0,$B33=0),0,IF(logic!$A$51=1,výkony!L32,výkony!Y32))","v":934},600,null,null,null,null,600,"KLC-070060-00-10","KLC-090060-00-10","KLC-122060-00-10","KLC-150060-00-10","KLC-182060-00-10","KLC-070060-00M10","KLC-090060-00M10","KLC-122060-00M10","KLC-150060-00M10","KLC-182060-00M10",600]
[null,{"$f":"IF(AND($K$5=logic!$I$4,$M$5=logic!$I$4),1,IF(AND(C34>=$K$5,C34<=$M$5),1,0))","v":1},750,{"$f":"IF(OR(D$12=0,$B34=0),0,IF(logic!$A$51=1,výkony!C33,výkony!P33))","v":400},{"$f":"IF(OR(E$12=0,$B34=0),0,IF(logic!$A$51=1,výkony!D33,výkony!Q33))","v":522},{"$f":"IF(OR(F$12=0,$B34=0),0,IF(logic!$A$51=1,výkony!E33,výkony!R33))","v":726},{"$f":"IF(OR(G$12=0,$B34=0),0,IF(logic!$A$51=1,výkony!F33,výkony!S33))","v":913},{"$f":"IF(OR(H$12=0,$B34=0),0,IF(logic!$A$51=1,výkony!G33,výkony!T33))","v":1138},{"$f":"IF(OR(I$12=0,$B34=0),0,IF(logic!$A$51=1,výkony!H33,výkony!U33))","v":400},{"$f":"IF(OR(J$12=0,$B34=0),0,IF(logic!$A$51=1,výkony!I33,výkony!V33))","v":522},{"$f":"IF(OR(K$12=0,$B34=0),0,IF(logic!$A$51=1,výkony!J33,výkony!W33))","v":726},{"$f":"IF(OR(L$12=0,$B34=0),0,IF(logic!$A$51=1,výkony!K33,výkony!X33))","v":913},{"$f":"IF(OR(M$12=0,$B34=0),0,IF(logic!$A$51=1,výkony!L33,výkony!Y33))","v":1138},750,null,null,null,null,750,"KLC-070075-00-10","KLC-090075-00-10","KLC-122075-00-10","KLC-150075-00-10","KLC-182075-00-10","KLC-070075-00M10","KLC-090075-00M10","KLC-122075-00M10","KLC-150075-00M10","KLC-182075-00M10",750]
[]
[null,null,null,"KORALUX STANDARD",null,null,null,null,null,null,null,null,null,null,null,null,null,null,null,"KORALUX STANDARD"]
[null,null,{"$f":"logic!$L$4","v":"Délka"},{"$f":"logic!$K$4&\" H [mm]\"","v":"Výška H [mm]"},null,null,null,null,null,null,null,null,null,null,null,null,null,null,{"$f":"logic!$L$4","v":"Délka"},{"$f":"logic!$K$4&\" H [mm]\"","v":"Výška H [mm]"}]
[null,null,"L [mm]",700,900,1220,1500,null,null,null,null,null,null,null,null,null,null,null,"L [mm]",700,900,1220,1500]
[null,{"$f":"IF(AND($K$5=logic!$I$4,$M$5=logic!$I$4),1,IF(C39=$K$5,1,0))","v":1},400,{"$f":"IF(OR(D$12=0,$B39=0),0,IF(logic!$A$51=1,výkony!C38,výkony!P38))","v":198},{"$f":"IF(OR(E$12=0,$B39=0),0,IF(logic!$A$51=1,výkony!D38,výkony!Q38))","v":254},{"$f":"IF(OR(F$12=0,$B39=0),0,IF(logic!$A$51=1,výkony!E38,výkony!R38))","v":345},{"$f":"IF(OR(G$12=0,$B39=0),0,IF(logic!$A$51=1,výkony!F38,výkony!S38))","v":427},null,null,null,null,null,null,null,null,null,null,null,400,{"$f":"\"KSC-\"&IF(LEN(T$38)=3,\"0\"&T$38/10,T$38/10)&\"0\"&$S39/10&\"-00-10\"","v":"KSC-070040-00-10"},"KSC-090040-00-10","KSC-122040-00-10","KSC-150040-00-10"]
[null,{"$f":"IF(AND($K$5=logic!$I$4,$M$5=logic!$I$4),1,IF(AND(C40>=$K$5,C40<=$M$5),1,0))","v":1},500,{"$f":"IF(OR(D$12=0,$B40=0),0,IF(logic!$A$51=1,výkony!C39,výkony!P39))","v":231},{"$f":"IF(OR(E$12=0,$B40=0),0,IF(logic!$A$51=1,výkony!D39,výkony!Q39))","v":297},{"$f":"IF(OR(F$12=0,$B40=0),0,IF(logic!$A$51=1,výkony!E39,výkony!R39))","v":403},{"$f":"IF(OR(G$12=0,$B40=0),0,IF(logic!$A$51=1,výkony!F39,výkony!S39))","v":499},null,null,null,null,null,null,null,null,null,null,null,500,"KSC-070050-00-10","KSC-090050-00-10","KSC-122050-00-10","KSC-150050-00-10"]
[null,{"$f":"IF(AND($K$5=logic!$I$4,$M$5=logic!$I$4),1,IF(AND(C41>=$K$5,C41<=$M$5),1,0))","v":1},600,{"$f":"IF(OR(D$12=0,$B41=0),0,IF(logic!$A$51=1,výkony!C40,výkony!P40))","v":263},{"$f":"IF(OR(E$12=0,$B41=0),0,IF(logic!$A$51=1,výkony!D40,výkony!Q40))","v":337},{"$f":"IF(OR(F$12=0,$B41=0),0,IF(logic!$A$51=1,výkony!E40,výkony!R40))","v":458},{"$f":"IF(OR(G$12=0,$B41=0),0,IF(logic!$A$51=1,výkony!F40,výkony!S40))","v":567},null,null,null,null,null,null,null,null,null,null,null,600,"KSC-070060-00-10","KSC-090060-00-10","KSC-122060-00-10","KSC-150060-00-10"]
[]
[null,null,null,"KORALUX LINEAR EXCLUSIVE - M"]
[null,null,{"$f":"logic!$L$4","v":"Délka"},{"$f":"logic!$K$4&\" H [mm]\"","v":"Výška H [mm]"}]
[null,null,"L [mm]",900,1220,1500,1820]
[null,{"$f":"IF(AND($K$5=logic!$I$4,$M$5=logic!$I$4),1,IF(C46=$K$5,1,0))","v":1},450,{"$f":"IF(OR(J$12=0,$B39=0),0,IF(logic!$A$51=1,výkony!C45,0))","v":249},{"$f":"IF(OR(K$12=0,$B39=0),0,IF(logic!$A$51=1,výkony!D45,0))","v":338},{"$f":"IF(OR(L$12=0,$B39=0),0,IF(logic!$A$51=1,výkony!E45,0))","v":419},{"$f":"IF(OR(M$12=0,$B39=0),0,IF(logic!$A$51=1,výkony!F45,0))","v":516}]
[null,{"$f":"IF(AND($K$5=logic!$I$4,$M$5=logic!$I$4),1,IF(AND(C47>=$K$5,C47<=$M$5),1,0))","v":1},600,{"$f":"IF(OR(J$12=0,$B40=0),0,IF(logic!$A$51=1,výkony!C46,0))","v":319},{"$f":"IF(OR(K$12=0,$B40=0),0,IF(logic!$A$51=1,výkony!D46,0))","v":433},{"$f":"IF(OR(L$12=0,$B40=0),0,IF(logic!$A$51=1,výkony!E46,0))","v":537},{"$f":"IF(OR(M$12=0,$B40=0),0,IF(logic!$A$51=1,výkony!F46,0))","v":662}]
[null,{"$f":"IF(AND($K$5=logic!$I$4,$M$5=logic!$I$4),1,IF(AND(C48>=$K$5,C48<=$M$5),1,0))","v":1},750,{"$f":"IF(OR(J$12=0,$B41=0),0,IF(logic!$A$51=1,výkony!C47,0))","v":387},{"$f":"IF(OR(K$12=0,$B41=0),0,IF(logic!$A$51=1,výkony!D47,0))","v":526},{"$f":"IF(OR(L$12=0,$B41=0),0,IF(logic!$A$51=1,výkony!E47,0))","v":652},{"$f":"IF(OR(M$12=0,$B41=0),0,IF(logic!$A$51=1,výkony!F47,0))","v":802}]
[]
[null,null,null,"KORALUX RONDO MAX",null,null,null,null,"KORALUX RONDO MAX - M",null,null,null,null,null,null,null,null,null,null,"KORALUX RONDO MAX",null,null,null,null,"KORALUX RONDO MAX - M"]
[null,null,{"$f":"logic!$L$4","v":"Délka"},{"$f":"logic!$K$4&\" H [mm]\"","v":"Výška H [mm]"},null,null,null,null,{"$f":"logic!$K$4&\" H [mm]\"","v":"Výška H [mm]"},null,null,null,null,{"$f":"logic!$L$4","v":"Délka"},null,null,null,null,{"$f":"logic!$L$4","v":"Délka"},{"$f":"logic!$K$4&\" H [mm]\"","v":"Výška H [mm]"},null,null,null,null,{"$f":"logic!$K$4&\" H [mm]\"","v":"Výška H [mm]"},null,null,null,null,{"$f":"logic!$L$4","v":"Délka"}]
[null,null,"L [mm]",700,900,1220,1500,1820,700,900,1220,1500,1820,"L [mm]",null,null,null,null,"L [mm]",700,900,1220,1500,1820,700,900,1220,1500,1820,"L [mm]"]
[null,{"$f":"IF(AND($K$5=logic!$I$4,$M$5=logic!$I$4),1,IF(AND(C53>=$K$5,C53<=$M$5),1,0))","v":1},445,{"$f":"IF(OR(D$12=0,$B53=0),0,IF(logic!$A$51=1,výkony!C52,výkony!P52))","v":335},{"$f":"IF(OR(E$12=0,$B53=0),0,IF(logic!$A$51=1,výkony!D52,výkony!Q52))","v":432},{"$f":"IF(OR(F$12=0,$B53=0),0,IF(logic!$A$51=1,výkony!E52,výkony!R52))","v":589},{"$f":"IF(OR(G$12=0,$B53=0),0,IF(logic!$A$51=1,výkony!F52,výkony!S52))","v":725},{"$f":"IF(OR(H$12=0,$B53=0),0,IF(logic!$A$51=1,výkony!G52,výkony!T52))","v":879},{"$f":"IF(OR(I$12=0,$B53=0),0,IF(logic!$A$51=1,výkony!H52,výkony!U52))","v":335},{"$f":"IF(OR(J$12=0,$B53=0),0,IF(logic!$A$51=1,výkony!I52,výkony!V52))","v":432},{"$f":"IF(OR(K$12=0,$B53=0),0,IF(logic!$A$51=1,výkony!J52,výkony!W52))","v":589},{"$f":"IF(OR(L$12=0,$B53=0),0,IF(logic!$A$51=1,výkony!K52,výkony!X52))","v":725},{"$f":"IF(OR(M$12=0,$B53=0),0,IF(logic!$A$51=1,výkony!L52,výkony!Y52))","v":879},445,null,null,null,null,445,{"$f":"\"KRM-\"&IF(LEN(T$52)=3,\"0\"&T$52/10,T$52/10)&\"0\"&ROUND($S53/10,0)&\"-00-10\"","v":"KRM-070045-00-10"},{"$f":"\"KRM-\"&IF(LEN(U$52)=3,\"0\"&U$52/10,U$52/10)&\"0\"&ROUND($S53/10,0)&\"-00-10\"","v":"KRM-090045-00-10"},"KRM-122045-00-10","KRM-150045-00-10","KRM-182045-00-10",{"$f":"\"KRM-\"&IF(LEN(Y$52)=3,\"0\"&Y$52/10,Y$52/10)&\"0\"&ROUND($S53/10,0)&\"-00M10\"","v":"KRM-070045-00M10"},{"$f":"\"KRM-\"&IF(LEN(Z$52)=3,\"0\"&Z$52/10,Z$52/10)&\"0\"&ROUND($S53/10,0)&\"-00M10\"","v":"KRM-090045-00M10"},"KRM-122045-00M10","KRM-150045-00M10","KRM-182045-00M10",445]
[null,{"$f":"IF(AND($K$5=logic!$I$4,$M$5=logic!$I$4),1,IF(AND(C54>=$K$5,C54<=$M$5),1,0))","v":1},595,{"$f":"IF(OR(D$12=0,$B54=0),0,IF(logic!$A$51=1,výkony!C53,výkony!P53))","v":444},{"$f":"IF(OR(E$12=0,$B54=0),0,IF(logic!$A$51=1,výkony!D53,výkony!Q53))","v":574},{"$f":"IF(OR(F$12=0,$B54=0),0,IF(logic!$A$51=1,výkony!E53,výkony!R53))","v":781},{"$f":"IF(OR(G$12=0,$B54=0),0,IF(logic!$A$51=1,výkony!F53,výkony!S53))","v":962},{"$f":"IF(OR(H$12=0,$B54=0),0,IF(logic!$A$51=1,výkony!G53,výkony!T53))","v":1166},{"$f":"IF(OR(I$12=0,$B54=0),0,IF(logic!$A$51=1,výkony!H53,výkony!U53))","v":444},{"$f":"IF(OR(J$12=0,$B54=0),0,IF(logic!$A$51=1,výkony!I53,výkony!V53))","v":574},{"$f":"IF(OR(K$12=0,$B54=0),0,IF(logic!$A$51=1,výkony!J53,výkony!W53))","v":781},{"$f":"IF(OR(L$12=0,$B54=0),0,IF(logic!$A$51=1,výkony!K53,výkony!X53))","v":962},{"$f":"IF(OR(M$12=0,$B54=0),0,IF(logic!$A$51=1,výkony!L53,výkony!Y53))","v":1166},595,null,null,null,null,595,{"$f":"\"KRM-\"&IF(LEN(T$52)=3,\"0\"&T$52/10,T$52/10)&\"0\"&ROUND($S54/10,0)&\"-00-10\"","v":"KRM-070060-00-10"},"KRM-090060-00-10","KRM-122060-00-10","KRM-150060-00-10","KRM-182060-00-10",{"$f":"\"KRM-\"&IF(LEN(Y$52)=3,\"0\"&Y$52/10,Y$52/10)&\"0\"&ROUND($S54/10,0)&\"-00M10\"","v":"KRM-070060-00M10"},"KRM-090060-00M10","KRM-122060-00M10","KRM-150060-00M10","KRM-182060-00M10",595]
[null,{"$f":"IF(AND($K$5=logic!$I$4,$M$5=logic!$I$4),1,IF(AND(C55>=$K$5,C55<=$M$5),1,0))","v":1},745,{"$f":"IF(OR(D$12=0,$B55=0),0,IF(logic!$A$51=1,výkony!C54,výkony!P54))","v":553},{"$f":"IF(OR(E$12=0,$B55=0),0,IF(logic!$A$51=1,výkony!D54,výkony!Q54))","v":714},{"$f":"IF(OR(F$12=0,$B55=0),0,IF(logic!$A$51=1,výkony!E54,výkony!R54))","v":973},{"$f":"IF(OR(G$12=0,$B55=0),0,IF(logic!$A$51=1,výkony!F54,výkony!S54))","v":1197},{"$f":"IF(OR(H$12=0,$B55=0),0,IF(logic!$A$51=1,výkony!G54,výkony!T54))","v":1452},{"$f":"IF(OR(I$12=0,$B55=0),0,IF(logic!$A$51=1,výkony!H54,výkony!U54))","v":553},{"$f":"IF(OR(J$12=0,$B55=0),0,IF(logic!$A$51=1,výkony!I54,výkony!V54))","v":714},{"$f":"IF(OR(K$12=0,$B55=0),0,IF(logic!$A$51=1,výkony!J54,výkony!W54))","v":973},{"$f":"IF(OR(L$12=0,$B55=0),0,IF(logic!$A$51=1,výkony!K54,výkony!X54))","v":1197},{"$f":"IF(OR(M$12=0,$B55=0),0,IF(logic!$A$51=1,výkony!L54,výkony!Y54))","v":1452},745,null,null,null,null,745,"KRM-070075-00-10","KRM-090075-00-10","KRM-122075-00-10","KRM-150075-00-10","KRM-182075-00-10","KRM-070075-00M10","KRM-090075-00M10","KRM-122075-00M10","KRM-150075-00M10","KRM-182075-00M10",745]
[]
[null,null,null,"KORALUX RONDO COMFORT",null,null,null,null,"KORALUX RONDO COMFORT - M",null,null,null,null,null,null,null,null,null,null,"KORALUX RONDO COMFORT",null,null,null,null,"KORALUX RONDO COMFORT - M"]
[null,null,{"$f":"logic!$L$4","v":"Délka"},{"$f":"logic!$K$4&\" H [mm]\"","v":"Výška H [mm]"},null,null,null,null,{"$f":"logic!$K$4&\" H [mm]\"","v":"Výška H [mm]"},null,null,null,null,{"$f":"logic!$L$4","v":"Délka"},null,null,null,null,{"$f":"logic!$L$4","v":"Délka"},{"$f":"logic!$K$4&\" H [mm]\"","v":"Výška H [mm]"},null,null,null,null,{"$f":"logic!$K$4&\" H [mm]\"","v":"Výška H [mm]"},null,null,null,null,{"$f":"logic!$L$4","v":"Délka"}]
[null,null,"L [mm]",700,900,1220,1500,1820,700,900,1220,1500,1820,"L [mm]",null,null,null,null,"L [mm]",700,900,1220,1500,1820,700,900,1220,1500,1820,"L [mm]"]
[null,{"$f":"IF(AND($K$5=logic!$I$4,$M$5=logic!$I$4),1,IF(AND(C60>=$K$5,C60<=$M$5),1,0))","v":1},445,{"$f":"IF(OR(D$12=0,$B60=0),0,IF(logic!$A$51=1,výkony!C59,výkony!P59))","v":287},{"$f":"IF(OR(E$12=0,$B60=0),0,IF(logic!$A$51=1,výkony!D59,výkony!Q59))","v":369},{"$f":"IF(OR(F$12=0,$B60=0),0,IF(logic!$A$51=1,výkony!E59,výkony!R59))","v":504},{"$f":"IF(OR(G$12=0,$B60=0),0,IF(logic!$A$51=1,výkony!F59,výkony!S59))","v":626},{"$f":"IF(OR(H$12=0,$B60=0),0,IF(logic!$A$51=1,výkony!G59,výkony!T59))","v":772},{"$f":"IF(OR(I$12=0,$B60=0),0,IF(logic!$A$51=1,výkony!H59,výkony!U59))","v":287},{"$f":"IF(OR(J$12=0,$B60=0),0,IF(logic!$A$51=1,výkony!I59,výkony!V59))","v":369},{"$f":"IF(OR(K$12=0,$B60=0),0,IF(logic!$A$51=1,výkony!J59,výkony!W59))","v":504},{"$f":"IF(OR(L$12=0,$B60=0),0,IF(logic!$A$51=1,výkony!K59,výkony!X59))","v":626},{"$f":"IF(OR(M$12=0,$B60=0),0,IF(logic!$A$51=1,výkony!L59,výkony!Y59))","v":772},445,null,null,null,null,445,{"$f":"\"KRT-\"&IF(LEN(T$59)=3,\"0\"&T$59/10,T$59/10)&\"0\"&ROUND($S60/10,0)&\"-00-10\"","v":"KRT-070045-00-10"},{"$f":"\"KRT-\"&IF(LEN(U$59)=3,\"0\"&U$59/10,U$59/10)&\"0\"&ROUND($S60/10,0)&\"-00-10\"","v":"KRT-090045-00-10"},"KRT-122045-00-10","KRT-150045-00-10","KRT-182045-00-10",{"$f":"\"KRT-\"&IF(LEN(Y$59)=3,\"0\"&Y$59/10,Y$59/10)&\"0\"&ROUND($S60/10,0)&\"-00M10\"","v":"KRT-070045-00M10"},{"$f":"\"KRT-\"&IF(LEN(Z$59)=3,\"0\"&Z$59/10,Z$59/10)&\"0\"&ROUND($S60/10,0)&\"-00M10\"","v":"KRT-090045-00M10"},"KRT-122045-00M10","KRT-150045-00M10","KRT-182045-00M10",445]
[null,{"$f":"IF(AND($K$5=logic!$I$4,$M$5=logic!$I$4),1,IF(AND(C61>=$K$5,C61<=$M$5),1,0))","v":1},495,{"$f":"IF(OR(D$12=0,$B61=0),0,IF(logic!$A$51=1,výkony!C60,výkony!P60))","v":315},{"$f":"IF(OR(E$12=0,$B61=0),0,IF(logic!$A$51=1,výkony!D60,výkony!Q60))","v":405},{"$f":"IF(OR(F$12=0,$B61=0),0,IF(logic!$A$51=1,výkony!E60,výkony!R60))","v":553},{"$f":"IF(OR(G$12=0,$B61=0),0,IF(logic!$A$51=1,výkony!F60,výkony!S60))","v":687},{"$f":"IF(OR(H$12=0,$B61=0),0,IF(logic!$A$51=1,výkony!G60,výkony!T60))","v":848},{"$f":"IF(OR(I$12=0,$B61=0),0,IF(logic!$A$51=1,výkony!H60,výkony!U60))","v":315},{"$f":"IF(OR(J$12=0,$B61=0),0,IF(logic!$A$51=1,výkony!I60,výkony!V60))","v":405},{"$f":"IF(OR(K$12=0,$B61=0),0,IF(logic!$A$51=1,výkony!J60,výkony!W60))","v":553},{"$f":"IF(OR(L$12=0,$B61=0),0,IF(logic!$A$51=1,výkony!K60,výkony!X60))","v":687},{"$f":"IF(OR(M$12=0,$B61=0),0,IF(logic!$A$51=1,výkony!L60,výkony!Y60))","v":848},495,null,null,null,null,495,{"$f":"\"KRT-\"&IF(LEN(T$59)=3,\"0\"&T$59/10,T$59/10)&\"0\"&ROUND($S61/10,0)&\"-00-10\"","v":"KRT-070050-00-10"},"KRT-090050-00-10","KRT-122050-00-10","KRT-150050-00-10","KRT-182050-00-10",{"$f":"\"KRT-\"&IF(LEN(Y$59)=3,\"0\"&Y$59/10,Y$59/10)&\"0\"&ROUND($S61/10,0)&\"-00M10\"","v":"KRT-070050-00M10"},"KRT-090050-00M10","KRT-122050-00M10","KRT-150050-00M10","KRT-182050-00M10",495]
[null,{"$f":"IF(AND($K$5=logic!$I$4,$M$5=logic!$I$4),1,IF(AND(C62>=$K$5,C62<=$M$5),1,0))","v":1},595,{"$f":"IF(OR(D$12=0,$B62=0),0,IF(logic!$A$51=1,výkony!C61,výkony!P61))","v":370},{"$f":"IF(OR(E$12=0,$B62=0),0,IF(logic!$A$51=1,výkony!D61,výkony!Q61))","v":475},{"$f":"IF(OR(F$12=0,$B62=0),0,IF(logic!$A$51=1,výkony!E61,výkony!R61))","v":650},{"$f":"IF(OR(G$12=0,$B62=0),0,IF(logic!$A$51=1,výkony!F61,výkony!S61))","v":808},{"$f":"IF(OR(H$12=0,$B62=0),0,IF(logic!$A$51=1,výkony!G61,výkony!T61))","v":996},{"$f":"IF(OR(I$12=0,$B62=0),0,IF(logic!$A$51=1,výkony!H61,výkony!U61))","v":370},{"$f":"IF(OR(J$12=0,$B62=0),0,IF(logic!$A$51=1,výkony!I61,výkony!V61))","v":475},{"$f":"IF(OR(K$12=0,$B62=0),0,IF(logic!$A$51=1,výkony!J61,výkony!W61))","v":650},{"$f":"IF(OR(L$12=0,$B62=0),0,IF(logic!$A$51=1,výkony!K61,výkony!X61))","v":808},{"$f":"IF(OR(M$12=0,$B62=0),0,IF(logic!$A$51=1,výkony!L61,výkony!Y61))","v":996},595,null,null,null,null,595,"KRT-070060-00-10","KRT-090060-00-10","KRT-122060-00-10","KRT-150060-00-10","KRT-182060-00-10","KRT-070060-00M10","KRT-090060-00M10","KRT-122060-00M10","KRT-150060-00M10","KRT-182060-00M10",595]
[null,{"$f":"IF(AND($K$5=logic!$I$4,$M$5=logic!$I$4),1,IF(AND(C63>=$K$5,C63<=$M$5),1,0))","v":1},745,{"$f":"IF(OR(D$12=0,$B63=0),0,IF(logic!$A$51=1,výkony!C62,výkony!P62))","v":450},{"$f":"IF(OR(E$12=0,$B63=0),0,IF(logic!$A$51=1,výkony!D62,výkony!Q62))","v":579},{"$f":"IF(OR(F$12=0,$B63=0),0,IF(logic!$A$51=1,výkony!E62,výkony!R62))","v":791},{"$f":"IF(OR(G$12=0,$B63=0),0,IF(logic!$A$51=1,výkony!F62,výkony!S62))","v":984},{"$f":"IF(OR(H$12=0,$B63=0),0,IF(logic!$A$51=1,výkony!G62,výkony!T62))","v":1213},{"$f":"IF(OR(I$12=0,$B63=0),0,IF(logic!$A$51=1,výkony!H62,výkony!U62))","v":450},{"$f":"IF(OR(J$12=0,$B63=0),0,IF(logic!$A$51=1,výkony!I62,výkony!V62))","v":579},{"$f":"IF(OR(K$12=0,$B63=0),0,IF(logic!$A$51=1,výkony!J62,výkony!W62))","v":791},{"$f":"IF(OR(L$12=0,$B63=0),0,IF(logic!$A$51=1,výkony!K62,výkony!X62))","v":984},{"$f":"IF(OR(M$12=0,$B63=0),0,IF(logic!$A$51=1,výkony!L62,výkony!Y62))","v":1213},745,null,null,null,null,745,"KRT-070075-00-10","KRT-090075-00-10","KRT-122075-00-10","KRT-150075-00-10","KRT-182075-00-10","KRT-070075-00M10","KRT-090075-00M10","KRT-122075-00M10","KRT-150075-00M10","KRT-182075-00M10",745]
[]
[null,null,null,"KORALUX RONDO CLASSIC",null,null,null,null,"KORALUX RONDO CLASSIC - M",null,null,null,null,null,null,null,null,null,null,"KORALUX RONDO CLASSIC",null,null,null,null,"KORALUX RONDO CLASSIC - M"]
[null,null,{"$f":"logic!$L$4","v":"Délka"},{"$f":"logic!$K$4&\" H [mm]\"","v":"Výška H [mm]"},null,null,null,null,{"$f":"logic!$K$4&\" H [mm]\"","v":"Výška H [mm]"},null,null,null,null,{"$f":"logic!$L$4","v":"Délka"},null,null,null,null,{"$f":"logic!$L$4","v":"Délka"},{"$f":"logic!$K$4&\" H [mm]\"","v":"Výška H [mm]"},null,null,null,null,{"$f":"logic!$K$4&\" H [mm]\"","v":"Výška H [mm]"},null,null,null,null,{"$f":"logic!$L$4","v":"Délka"}]
[null,null,"L [mm]",700,900,1220,1500,1820,700,900,1220,1500,1820,"L [mm]",null,null,null,null,"L [mm]",700,900,1220,1500,1820,700,900,1220,1500,1820,"L [mm]"]
[null,{"$f":"IF(AND($K$5=logic!$I$4,$M$5=logic!$I$4),1,IF(AND(C68>=$K$5,C68<=$M$5),1,0))","v":1},445,{"$f":"IF(OR(D$12=0,$B68=0),0,IF(logic!$A$51=1,výkony!C67,výkony!P67))","v":255},{"$f":"IF(OR(E$12=0,$B68=0),0,IF(logic!$A$51=1,výkony!D67,výkony!Q67))","v":333},{"$f":"IF(OR(F$12=0,$B68=0),0,IF(logic!$A$51=1,výkony!E67,výkony!R67))","v":462},{"$f":"IF(OR(G$12=0,$B68=0),0,IF(logic!$A$51=1,výkony!F67,výkony!S67))","v":581},{"$f":"IF(OR(H$12=0,$B68=0),0,IF(logic!$A$51=1,výkony!G67,výkony!T67))","v":725},{"$f":"IF(OR(I$12=0,$B68=0),0,IF(logic!$A$51=1,výkony!H67,výkony!U67))","v":255},{"$f":"IF(OR(J$12=0,$B68=0),0,IF(logic!$A$51=1,výkony!I67,výkony!V67))","v":333},{"$f":"IF(OR(K$12=0,$B68=0),0,IF(logic!$A$51=1,výkony!J67,výkony!W67))","v":462},{"$f":"IF(OR(L$12=0,$B68=0),0,IF(logic!$A$51=1,výkony!K67,výkony!X67))","v":581},{"$f":"IF(OR(M$12=0,$B68=0),0,IF(logic!$A$51=1,výkony!L67,výkony!Y67))","v":725},445,null,null,null,null,445,{"$f":"\"KRC-\"&IF(LEN(T$67)=3,\"0\"&T$67/10,T$67/10)&\"0\"&ROUND($S68/10,0)&\"-00-10\"","v":"KRC-070045-00-10"},{"$f":"\"KRC-\"&IF(LEN(U$67)=3,\"0\"&U$67/10,U$67/10)&\"0\"&ROUND($S68/10,0)&\"-00-10\"","v":"KRC-090045-00-10"},"KRC-122045-00-10","KRC-150045-00-10","KRC-182045-00-10",{"$f":"\"KRC-\"&IF(LEN(Y$67)=3,\"0\"&Y$67/10,Y$67/10)&\"0\"&ROUND($S68/10,0)&\"-00M10\"","v":"KRC-070045-00M10"},{"$f":"\"KRC-\"&IF(LEN(Z$67)=3,\"0\"&Z$67/10,Z$67/10)&\"0\"&ROUND($S68/10,0)&\"-00M10\"","v":"KRC-090045-00M10"},"KRC-122045-00M10","KRC-150045-00M10","KRC-182045-00M10",445]
[null,1,495,{"$f":"IF(OR(D$12=0,$B69=0),0,IF(logic!$A$51=1,výkony!C68,výkony!P68))","v":280},{"$f":"IF(OR(E$12=0,$B69=0),0,IF(logic!$A$51=1,výkony!D68,výkony!Q68))","v":365},{"$f":"IF(OR(F$12=0,$B69=0),0,IF(logic!$A$51=1,výkony!E68,výkony!R68))","v":507},{"$f":"IF(OR(G$12=0,$B69=0),0,IF(logic!$A$51=1,výkony!F68,výkony!S68))","v":638},{"$f":"IF(OR(H$12=0,$B69=0),0,IF(logic!$A$51=1,výkony!G68,výkony!T68))","v":795},{"$f":"IF(OR(I$12=0,$B69=0),0,IF(logic!$A$51=1,výkony!H68,výkony!U68))","v":280},{"$f":"IF(OR(J$12=0,$B69=0),0,IF(logic!$A$51=1,výkony!I68,výkony!V68))","v":365},{"$f":"IF(OR(K$12=0,$B69=0),0,IF(logic!$A$51=1,výkony!J68,výkony!W68))","v":507},{"$f":"IF(OR(L$12=0,$B69=0),0,IF(logic!$A$51=1,výkony!K68,výkony!X68))","v":638},{"$f":"IF(OR(M$12=0,$B69=0),0,IF(logic!$A$51=1,výkony!L68,výkony!Y68))","v":795},495,null,null,null,null,495,{"$f":"\"KRC-\"&IF(LEN(T$67)=3,\"0\"&T$67/10,T$67/10)&\"0\"&ROUND($S69/10,0)&\"-00-10\"","v":"KRC-070050-00-10"},"KRC-090050-00-10","KRC-122050-00-10","KRC-150050-00-10","KRC-182050-00-10",{"$f":"\"KRC-\"&IF(LEN(Y$67)=3,\"0\"&Y$67/10,Y$67/10)&\"0\"&ROUND($S69/10,0)&\"-00M10\"","v":"KRC-070050-00M10"},"KRC-090050-00M10","KRC-122050-00M10","KRC-150050-00M10","KRC-182050-00M10",495]
[null,{"$f":"IF(AND($K$5=logic!$I$4,$M$5=logic!$I$4),1,IF(AND(C70>=$K$5,C70<=$M$5),1,0))","v":1},595,{"$f":"IF(OR(D$12=0,$B70=0),0,IF(logic!$A$51=1,výkony!C69,výkony!P69))","v":329},{"$f":"IF(OR(E$12=0,$B70=0),0,IF(logic!$A$51=1,výkony!D69,výkony!Q69))","v":429},{"$f":"IF(OR(F$12=0,$B70=0),0,IF(logic!$A$51=1,výkony!E69,výkony!R69))","v":596},{"$f":"IF(OR(G$12=0,$B70=0),0,IF(logic!$A$51=1,výkony!F69,výkony!S69))","v":750},{"$f":"IF(OR(H$12=0,$B70=0),0,IF(logic!$A$51=1,výkony!G69,výkony!T69))","v":934},{"$f":"IF(OR(I$12=0,$B70=0),0,IF(logic!$A$51=1,výkony!H69,výkony!U69))","v":329},{"$f":"IF(OR(J$12=0,$B70=0),0,IF(logic!$A$51=1,výkony!I69,výkony!V69))","v":429},{"$f":"IF(OR(K$12=0,$B70=0),0,IF(logic!$A$51=1,výkony!J69,výkony!W69))","v":596},{"$f":"IF(OR(L$12=0,$B70=0),0,IF(logic!$A$51=1,výkony!K69,výkony!X69))","v":750},{"$f":"IF(OR(M$12=0,$B70=0),0,IF(logic!$A$51=1,výkony!L69,výkony!Y69))","v":934},595,null,null,null,null,595,"KRC-070060-00-10","KRC-090060-00-10","KRC-122060-00-10","KRC-150060-00-10","KRC-182060-00-10","KRC-070060-00M10","KRC-090060-00M10","KRC-122060-00M10","KRC-150060-00M10","KRC-182060-00M10",595]
[null,{"$f":"IF(AND($K$5=logic!$I$4,$M$5=logic!$I$4),1,IF(AND(C71>=$K$5,C71<=$M$5),1,0))","v":1},745,{"$f":"IF(OR(D$12=0,$B71=0),0,IF(logic!$A$51=1,výkony!C70,výkony!P70))","v":400},{"$f":"IF(OR(E$12=0,$B71=0),0,IF(logic!$A$51=1,výkony!D70,výkony!Q70))","v":522},{"$f":"IF(OR(F$12=0,$B71=0),0,IF(logic!$A$51=1,výkony!E70,výkony!R70))","v":726},{"$f":"IF(OR(G$12=0,$B71=0),0,IF(logic!$A$51=1,výkony!F70,výkony!S70))","v":913},{"$f":"IF(OR(H$12=0,$B71=0),0,IF(logic!$A$51=1,výkony!G70,výkony!T70))","v":1138},{"$f":"IF(OR(I$12=0,$B71=0),0,IF(logic!$A$51=1,výkony!H70,výkony!U70))","v":400},{"$f":"IF(OR(J$12=0,$B71=0),0,IF(logic!$A$51=1,výkony!I70,výkony!V70))","v":522},{"$f":"IF(OR(K$12=0,$B71=0),0,IF(logic!$A$51=1,výkony!J70,výkony!W70))","v":726},{"$f":"IF(OR(L$12=0,$B71=0),0,IF(logic!$A$51=1,výkony!K70,výkony!X70))","v":913},{"$f":"IF(OR(M$12=0,$B71=0),0,IF(logic!$A$51=1,výkony!L70,výkony!Y70))","v":1138},745,null,null,null,null,745,"KRC-070075-00-10","KRC-090075-00-10","KRC-122075-00-10","KRC-150075-00-10","KRC-182075-00-10","KRC-070075-00M10","KRC-090075-00M10","KRC-122075-00M10","KRC-150075-00M10","KRC-182075-00M10",745]
[]
[null,null,null,"KORALUX RONDO EXCLUSIVE - M",null,null,null,null,null,null,null,null,null,null,null,null,null,null,null,"KORALUX LINEAR EXCLUSIVE - M",null,null,null,null,null,"KORALUX RONDO EXCLUSIVE - M"]
[null,null,{"$f":"logic!$L$4","v":"Délka"},{"$f":"logic!$K$4&\" H [mm]\"","v":"Výška H [mm]"},null,null,null,null,null,null,null,null,null,null,null,null,null,null,{"$f":"logic!$L$4","v":"Délka"},{"$f":"logic!$K$4&\" H [mm]\"","v":"Výška H [mm]"},null,null,null,null,{"$f":"logic!$L$4","v":"Délka"},{"$f":"logic!$K$4&\" H [mm]\"","v":"Výška H [mm]"}]
[null,null,"L [mm]",900,1220,1500,1820,null,null,null,null,null,null,null,null,null,null,null,"L [mm]",900,1220,1500,1820,null,"L [mm]",900,1220,1500,1820]
[null,{"$f":"IF(AND($K$5=logic!$I$4,$M$5=logic!$I$4),1,IF(AND(C46>=$K$5,C46<=$M$5),1,0))","v":1},445,{"$f":"IF(OR(E$12=0,$B76=0),0,IF(logic!$A$51=1,výkony!C75,0))","v":249},{"$f":"IF(OR(F$12=0,$B76=0),0,IF(logic!$A$51=1,výkony!D75,0))","v":338},{"$f":"IF(OR(G$12=0,$B76=0),0,IF(logic!$A$51=1,výkony!E75,0))","v":419},{"$f":"IF(OR(H$12=0,$B76=0),0,IF(logic!$A$51=1,výkony!F75,0))","v":516},null,null,null,null,null,null,null,null,null,null,null,445,{"$f":"\"KLX-\"&IF(LEN(T$75)=3,\"0\"&T$75/10,T$75/10)&\"0\"&ROUND($S76/10,0)&\"-00M27\"","v":"KLX-090045-00M27"},{"$f":"\"KLX-\"&IF(LEN(U$75)=3,\"0\"&U$75/10,U$75/10)&\"0\"&ROUND($S76/10,0)&\"-00M27\"","v":"KLX-122045-00M27"},"KLX-150045-00M27","KLX-182045-00M27",null,450,{"$f":"\"KRX-\"&IF(LEN(Z$75)=3,\"0\"&Z$75/10,Z$75/10)&\"0\"&ROUND($S76/10,0)&\"-00M27\"","v":"KRX-090045-00M27"},{"$f":"\"KRX-\"&IF(LEN(AA$75)=3,\"0\"&AA$75/10,AA$75/10)&\"0\"&ROUND($S76/10,0)&\"-00M27\"","v":"KRX-122045-00M27"},"KRX-150045-00M27","KRX-182045-00M27"]
[null,{"$f":"IF(AND($K$5=logic!$I$4,$M$5=logic!$I$4),1,IF(AND(C47>=$K$5,C47<=$M$5),1,0))","v":1},595,{"$f":"IF(OR(E$12=0,$B77=0),0,IF(logic!$A$51=1,výkony!C76,0))","v":319},{"$f":"IF(OR(F$12=0,$B77=0),0,IF(logic!$A$51=1,výkony!D76,0))","v":433},{"$f":"IF(OR(G$12=0,$B77=0),0,IF(logic!$A$51=1,výkony!E76,0))","v":537},{"$f":"IF(OR(H$12=0,$B77=0),0,IF(logic!$A$51=1,výkony!F76,0))","v":662},null,null,null,null,null,null,null,null,null,null,null,595,{"$f":"\"KLX-\"&IF(LEN(T$75)=3,\"0\"&T$75/10,T$75/10)&\"0\"&ROUND($S77/10,0)&\"-00M27\"","v":"KLX-090060-00M27"},"KLX-122060-00M27","KLX-150060-00M27","KLX-182060-00M27",null,600,{"$f":"\"KRX-\"&IF(LEN(Z$75)=3,\"0\"&Z$75/10,Z$75/10)&\"0\"&ROUND($S77/10,0)&\"-00M27\"","v":"KRX-090060-00M27"},"KRX-122060-00M27","KRX-150060-00M27","KRX-182060-00M27"]
[null,{"$f":"IF(AND($K$5=logic!$I$4,$M$5=logic!$I$4),1,IF(AND(C48>=$K$5,C48<=$M$5),1,0))","v":1},745,{"$f":"IF(OR(E$12=0,$B78=0),0,IF(logic!$A$51=1,výkony!C77,0))","v":387},{"$f":"IF(OR(F$12=0,$B78=0),0,IF(logic!$A$51=1,výkony!D77,0))","v":526},{"$f":"IF(OR(G$12=0,$B78=0),0,IF(logic!$A$51=1,výkony!E77,0))","v":652},{"$f":"IF(OR(H$12=0,$B78=0),0,IF(logic!$A$51=1,výkony!F77,0))","v":802},null,null,null,null,null,null,null,null,null,null,null,745,"KLX-090075-00M27","KLX-122075-00M27","KLX-150075-00M27","KLX-182075-00M27",null,750,"KRX-090075-00M27","KRX-122075-00M27","KRX-150075-00M27","KRX-182075-00M27"]
[]
[null,null,{"$f":"logic!V4&\" \"&logic!W4&\" \"&logic!X4","v":"Technické změny vyhrazeny. Uvedené výkony jsou platné pouze pro zemi: Česká republika."},null,null,null,null,null,null,null,null,null,null,{"$f":"logic!E67","v":"CZ OTT 1.02-01/17 M"}]

{"sheet":"Databáze","index":1,"n_rows":6,"n_cols":11,"rows_kept":6,"cut":false,"hidden":true,"merged":[]}
[{"$f":"logic!AB24","v":"Identifikace:"}]
[]
[]
[]
[]
[{"$f":"logic!Q24","v":"Číslo"},{"$f":"logic!R24","v":"Model"},{"$f":"logic!S24","v":"Objednací číslo"},{"$f":"logic!U24","v":"Výška [mm]"},{"$f":"logic!V24","v":"Délka [mm]"},{"$f":"logic!W24","v":"t1"},{"$f":"logic!X24","v":"t2"},{"$f":"logic!Y24","v":"ti"},{"$f":"logic!Z24&\" \"&logic!$E$45","v":"Tepelný výkon [W]"},{"$f":"logic!U4","v":"Způsob připojení"},{"$f":"logic!AA24","v":"Poznámka"}]

{"sheet":"výkony","index":2,"n_rows":77,"n_cols":26,"rows_kept":77,"cut":false,"hidden":true,"merged":[]}
[]
[]
[null,null,{"$f":"logic!P4","v":"Teplota:"}]
[null,null,"t 1","t 2","t i"," D T",null,{"$f":"logic!Y4","v":"Jednotka výkonu:"}]
[null,null,{"$f":"KORADO!C4","v":75},{"$f":"KORADO!D4","v":65},{"$f":"KORADO!E4","v":20},{"$f":"(C5+D5)/2-E5","v":50},null,{"$f":"logic!C45","v":"W"},{"$f":"logic!D45","v":1}]
[]
[]
[]
[]
[]
[null,null,"VÝKONY PRO ZAPOJENÍ ZDOLA DOLŮ",null,null,null,null,null,null,null,null,null,null,null,"VÝKONY PRO ÚHLOPŘÍČNÉ ZAPOJENÍ"]
[null,null,"KORALUX LINEAR MAX",null,null,null,null,"KORALUX LINEAR MAX - M",null,null,null,null,null,null,null,"KORALUX LINEAR MAX",null,null,null,null,"KORALUX LINEAR MAX - M"]
[null,"Délka L","Výška H [mm]",null,null,null,null,"Výška H [mm]",null,null,null,null,"Délka L",null,"Délka L","Výška H [mm]",null,null,null,null,"Výška H [mm]",null,null,null,null,"Délka L"]
[null,"[mm]",700,900,1220,1500,1820,700,900,1220,1500,1820,"[mm]",null,"[mm]",700,900,1220,1500,1820,700,900,1220,1500,1820,"[mm]"]
[null,450,{"$f":"ROUND((((($C$5-$D$5)/(LN(($C$5-$E$5)/($D$5-$E$5))))/49.8328865456397)^vstupy!C22)*vstupy!C15*$I$5,0)","v":320},{"$f":"ROUND((((($C$5-$D$5)/(LN(($C$5-$E$5)/($D$5-$E$5))))/49.8328865456397)^vstupy!D$22)*vstupy!D15*$I$5,0)","v":411},{"$f":"ROUND((((($C$5-$D$5)/(LN(($C$5-$E$5)/($D$5-$E$5))))/49.8328865456397)^vstupy!E$22)*vstupy!E15*$I$5,0)","v":557},{"$f":"ROUND((((($C$5-$D$5)/(LN(($C$5-$E$5)/($D$5-$E$5))))/49.8328865456397)^vstupy!F$22)*vstupy!F15*$I$5,0)","v":686},{"$f":"ROUND((((($C$5-$D$5)/(LN(($C$5-$E$5)/($D$5-$E$5))))/49.8328865456397)^vstupy!G$22)*vstupy!G15*$I$5,0)","v":833},{"$f":"ROUND((((($C$5-$D$5)/(LN(($C$5-$E$5)/($D$5-$E$5))))/49.8328865456397)^vstupy!H$22)*vstupy!H15*$I$5,0)","v":320},{"$f":"ROUND((((($C$5-$D$5)/(LN(($C$5-$E$5)/($D$5-$E$5))))/49.8328865456397)^vstupy!I$22)*vstupy!I15*$I$5,0)","v":411},{"$f":"ROUND((((($C$5-$D$5)/(LN(($C$5-$E$5)/($D$5-$E$5))))/49.8328865456397)^vstupy!J$22)*vstupy!J15*$I$5,0)","v":557},{"$f":"ROUND((((($C$5-$D$5)/(LN(($C$5-$E$5)/($D$5-$E$5))))/49.8328865456397)^vstupy!K$22)*vstupy!K15*$I$5,0)","v":686},{"$f":"ROUND((((($C$5-$D$5)/(LN(($C$5-$E$5)/($D$5-$E$5))))/49.8328865456397)^vstupy!L$22)*vstupy!L15*$I$5,0)","v":833},450,null,450,{"$f":"ROUND((((($C$5-$D$5)/(LN(($C$5-$E$5)/($D$5-$E$5))))/49.8328865456397)^vstupy!P$22)*vstupy!P15*$I$5,0)","v":341},{"$f":"ROUND((((($C$5-$D$5)/(LN(($C$5-$E$5)/($D$5-$E$5))))/49.8328865456397)^vstupy!Q$22)*vstupy!Q15*$I$5,0)","v":436},{"$f":"ROUND((((($C$5-$D$5)/(LN(($C$5-$E$5)/($D$5-$E$5))))/49.8328865456397)^vstupy!R$22)*vstupy!R15*$I$5,0)","v":592},{"$f":"ROUND((((($C$5-$D$5)/(LN(($C$5-$E$5)/($D$5-$E$5))))/49.8328865456397)^vstupy!S$22)*vstupy!S15*$I$5,0)","v":735},{"$f":"ROUND((((($C$5-$D$5)/(LN(($C$5-$E$5)/($D$5-$E$5))))/49.8328865456397)^vstupy!T$22)*vstupy!T15*$I$5,0)","v":906},null,null,null,null,null,450]
[null,600,{"$f":"ROUND((((($C$5-$D$5)/(LN(($C$5-$E$5)/($D$5-$E$5))))/49.8328865456397)^vstupy!C23)*vstupy!C16*$I$5,0)","v":422},{"$f":"ROUND((((($C$5-$D$5)/(LN(($C$5-$E$5)/($D$5-$E$5))))/49.8328865456397)^vstupy!D23)*vstupy!D16*$I$5,0)","v":543},{"$f":"ROUND((((($C$5-$D$5)/(LN(($C$5-$E$5)/($D$5-$E$5))))/49.8328865456397)^vstupy!E23)*vstupy!E16*$I$5,0)","v":736},{"$f":"ROUND((((($C$5-$D$5)/(LN(($C$5-$E$5)/($D$5-$E$5))))/49.8328865456397)^vstupy!F23)*vstupy!F16*$I$5,0)","v":906},{"$f":"ROUND((((($C$5-$D$5)/(LN(($C$5-$E$5)/($D$5-$E$5))))/49.8328865456397)^vstupy!G23)*vstupy!G16*$I$5,0)","v":1101},{"$f":"ROUND((((($C$5-$D$5)/(LN(($C$5-$E$5)/($D$5-$E$5))))/49.8328865456397)^vstupy!H23)*vstupy!H16*$I$5,0)","v":422},{"$f":"ROUND((((($C$5-$D$5)/(LN(($C$5-$E$5)/($D$5-$E$5))))/49.8328865456397)^vstupy!I23)*vstupy!I16*$I$5,0)","v":543},{"$f":"ROUND((((($C$5-$D$5)/(LN(($C$5-$E$5)/($D$5-$E$5))))/49.8328865456397)^vstupy!J23)*vstupy!J16*$I$5,0)","v":736},{"$f":"ROUND((((($C$5-$D$5)/(LN(($C$5-$E$5)/($D$5-$E$5))))/49.8328865456397)^vstupy!K23)*vstupy!K16*$I$5,0)","v":906},{"$f":"ROUND((((($C$5-$D$5)/(LN(($C$5-$E$5)/($D$5-$E$5))))/49.8328865456397)^vstupy!L23)*vstupy!L16*$I$5,0)","v":1101},600,null,600,{"$f":"ROUND((((($C$5-$D$5)/(LN(($C$5-$E$5)/($D$5-$E$5))))/49.8328865456397)^vstupy!P23)*vstupy!P16*$I$5,0)","v":454},{"$f":"ROUND((((($C$5-$D$5)/(LN(($C$5-$E$5)/($D$5-$E$5))))/49.8328865456397)^vstupy!Q23)*vstupy!Q16*$I$5,0)","v":580},{"$f":"ROUND((((($C$5-$D$5)/(LN(($C$5-$E$5)/($D$5-$E$5))))/49.8328865456397)^vstupy!R23)*vstupy!R16*$I$5,0)","v":789},{"$f":"ROUND((((($C$5-$D$5)/(LN(($C$5-$E$5)/($D$5-$E$5))))/49.8328865456397)^vstupy!S23)*vstupy!S16*$I$5,0)","v":979},{"$f":"ROUND((((($C$5-$D$5)/(LN(($C$5-$E$5)/($D$5-$E$5))))/49.8328865456397)^vstupy!T23)*vstupy!T16*$I$5,0)","v":1206},null,null,null,null,null,600]
[null,750,{"$f":"ROUND((((($C$5-$D$5)/(LN(($C$5-$E$5)/($D$5-$E$5))))/49.8328865456397)^vstupy!C24)*vstupy!C17*$I$5,0)","v":524},{"$f":"ROUND((((($C$5-$D$5)/(LN(($C$5-$E$5)/($D$5-$E$5))))/49.8328865456397)^vstupy!D24)*vstupy!D17*$I$5,0)","v":673},{"$f":"ROUND((((($C$5-$D$5)/(LN(($C$5-$E$5)/($D$5-$E$5))))/49.8328865456397)^vstupy!E24)*vstupy!E17*$I$5,0)","v":913},{"$f":"ROUND((((($C$5-$D$5)/(LN(($C$5-$E$5)/($D$5-$E$5))))/49.8328865456397)^vstupy!F24)*vstupy!F17*$I$5,0)","v":1124},{"$f":"ROUND((((($C$5-$D$5)/(LN(($C$5-$E$5)/($D$5-$E$5))))/49.8328865456397)^vstupy!G24)*vstupy!G17*$I$5,0)","v":1367},{"$f":"ROUND((((($C$5-$D$5)/(LN(($C$5-$E$5)/($D$5-$E$5))))/49.8328865456397)^vstupy!H24)*vstupy!H17*$I$5,0)","v":524},{"$f":"ROUND((((($C$5-$D$5)/(LN(($C$5-$E$5)/($D$5-$E$5))))/49.8328865456397)^vstupy!I24)*vstupy!I17*$I$5,0)","v":673},{"$f":"ROUND((((($C$5-$D$5)/(LN(($C$5-$E$5)/($D$5-$E$5))))/49.8328865456397)^vstupy!J24)*vstupy!J17*$I$5,0)","v":913},{"$f":"ROUND((((($C$5-$D$5)/(LN(($C$5-$E$5)/($D$5-$E$5))))/49.8328865456397)^vstupy!K24)*vstupy!K17*$I$5,0)","v":1124},{"$f":"ROUND((((($C$5-$D$5)/(LN(($C$5-$E$5)/($D$5-$E$5))))/49.8328865456397)^vstupy!L24)*vstupy!L17*$I$5,0)","v":1367},750,null,750,{"$f":"ROUND((((($C$5-$D$5)/(LN(($C$5-$E$5)/($D$5-$E$5))))/49.8328865456397)^vstupy!P24)*vstupy!P17*$I$5,0)","v":567},{"$f":"ROUND((((($C$5-$D$5)/(LN(($C$5-$E$5)/($D$5-$E$5))))/49.8328865456397)^vstupy!Q24)*vstupy!Q17*$I$5,0)","v":725},{"$f":"ROUND((((($C$5-$D$5)/(LN(($C$5-$E$5)/($D$5-$E$5))))/49.8328865456397)^vstupy!R24)*vstupy!R17*$I$5,0)","v":985},{"$f":"ROUND((((($C$5-$D$5)/(LN(($C$5-$E$5)/($D$5-$E$5))))/49.8328865456397)^vstupy!S24)*vstupy!S17*$I$5,0)","v":1222},{"$f":"ROUND((((($C$5-$D$5)/(LN(($C$5-$E$5)/($D$5-$E$5))))/49.8328865456397)^vstupy!T24)*vstupy!T17*$I$5,0)","v":1507},null,null,null,null,null,750]
[]
[null,null,"KORALUX LINEAR COMFORT",null,null,null,null,"KORALUX LINEAR COMFORT - M",null,null,null,null,null,null,null,"KORALUX LINEAR COMFORT",null,null,null,null,"KORALUX LINEAR COMFORT - M"]
[null,"Délka L","Výška H [mm]",null,null,null,null,"Výška H [mm]",null,null,null,null,"Délka L",null,"Délka L","Výška H [mm]",null,null,null,null,"Výška H [mm]",null,null,null,null,"Délka L"]
[null,"[mm]",700,900,1220,1500,1820,700,900,1220,1500,1820,"[mm]",null,"[mm]",700,900,1220,1500,1820,700,900,1220,1500,1820,"[mm]"]
[null,450,{"$f":"ROUND((((($C$5-$D$5)/(LN(($C$5-$E$5)/($D$5-$E$5))))/49.8328865456397)^vstupy!C37)*vstupy!C29*$I$5,0)","v":287},{"$f":"ROUND((((($C$5-$D$5)/(LN(($C$5-$E$5)/($D$5-$E$5))))/49.8328865456397)^vstupy!D37)*vstupy!D29*$I$5,0)","v":369},{"$f":"ROUND((((($C$5-$D$5)/(LN(($C$5-$E$5)/($D$5-$E$5))))/49.8328865456397)^vstupy!E37)*vstupy!E29*$I$5,0)","v":504},{"$f":"ROUND((((($C$5-$D$5)/(LN(($C$5-$E$5)/($D$5-$E$5))))/49.8328865456397)^vstupy!F37)*vstupy!F29*$I$5,0)","v":626},{"$f":"ROUND((((($C$5-$D$5)/(LN(($C$5-$E$5)/($D$5-$E$5))))/49.8328865456397)^vstupy!G37)*vstupy!G29*$I$5,0)","v":772},{"$f":"ROUND((((($C$5-$D$5)/(LN(($C$5-$E$5)/($D$5-$E$5))))/49.8328865456397)^vstupy!H37)*vstupy!H29*$I$5,0)","v":287},{"$f":"ROUND((((($C$5-$D$5)/(LN(($C$5-$E$5)/($D$5-$E$5))))/49.8328865456397)^vstupy!I37)*vstupy!I29*$I$5,0)","v":369},{"$f":"ROUND((((($C$5-$D$5)/(LN(($C$5-$E$5)/($D$5-$E$5))))/49.8328865456397)^vstupy!J37)*vstupy!J29*$I$5,0)","v":504},{"$f":"ROUND((((($C$5-$D$5)/(LN(($C$5-$E$5)/($D$5-$E$5))))/49.8328865456397)^vstupy!K37)*vstupy!K29*$I$5,0)","v":626},{"$f":"ROUND((((($C$5-$D$5)/(LN(($C$5-$E$5)/($D$5-$E$5))))/49.8328865456397)^vstupy!L37)*vstupy!L29*$I$5,0)","v":772},450,null,450,{"$f":"ROUND((((($C$5-$D$5)/(LN(($C$5-$E$5)/($D$5-$E$5))))/49.8328865456397)^vstupy!P37)*vstupy!P29*$I$5,0)","v":312},{"$f":"ROUND((((($C$5-$D$5)/(LN(($C$5-$E$5)/($D$5-$E$5))))/49.8328865456397)^vstupy!Q37)*vstupy!Q29*$I$5,0)","v":402},{"$f":"ROUND((((($C$5-$D$5)/(LN(($C$5-$E$5)/($D$5-$E$5))))/49.8328865456397)^vstupy!R37)*vstupy!R29*$I$5,0)","v":549},{"$f":"ROUND((((($C$5-$D$5)/(LN(($C$5-$E$5)/($D$5-$E$5))))/49.8328865456397)^vstupy!S37)*vstupy!S29*$I$5,0)","v":682},{"$f":"ROUND((((($C$5-$D$5)/(LN(($C$5-$E$5)/($D$5-$E$5))))/49.8328865456397)^vstupy!T37)*vstupy!T29*$I$5,0)","v":841},null,null,null,null,null,450]
[null,500,{"$f":"ROUND((((($C$5-$D$5)/(LN(($C$5-$E$5)/($D$5-$E$5))))/49.8328865456397)^vstupy!C38)*vstupy!C30*$I$5,0)","v":315},{"$f":"ROUND((((($C$5-$D$5)/(LN(($C$5-$E$5)/($D$5-$E$5))))/49.8328865456397)^vstupy!D38)*vstupy!D30*$I$5,0)","v":405},{"$f":"ROUND((((($C$5-$D$5)/(LN(($C$5-$E$5)/($D$5-$E$5))))/49.8328865456397)^vstupy!E38)*vstupy!E30*$I$5,0)","v":553},{"$f":"ROUND((((($C$5-$D$5)/(LN(($C$5-$E$5)/($D$5-$E$5))))/49.8328865456397)^vstupy!F38)*vstupy!F30*$I$5,0)","v":687},{"$f":"ROUND((((($C$5-$D$5)/(LN(($C$5-$E$5)/($D$5-$E$5))))/49.8328865456397)^vstupy!G38)*vstupy!G30*$I$5,0)","v":848},{"$f":"ROUND((((($C$5-$D$5)/(LN(($C$5-$E$5)/($D$5-$E$5))))/49.8328865456397)^vstupy!H38)*vstupy!H30*$I$5,0)","v":315},{"$f":"ROUND((((($C$5-$D$5)/(LN(($C$5-$E$5)/($D$5-$E$5))))/49.8328865456397)^vstupy!I38)*vstupy!I30*$I$5,0)","v":405},{"$f":"ROUND((((($C$5-$D$5)/(LN(($C$5-$E$5)/($D$5-$E$5))))/49.8328865456397)^vstupy!J38)*vstupy!J30*$I$5,0)","v":553},{"$f":"ROUND((((($C$5-$D$5)/(LN(($C$5-$E$5)/($D$5-$E$5))))/49.8328865456397)^vstupy!K38)*vstupy!K30*$I$5,0)","v":687},{"$f":"ROUND((((($C$5-$D$5)/(LN(($C$5-$E$5)/($D$5-$E$5))))/49.8328865456397)^vstupy!L38)*vstupy!L30*$I$5,0)","v":848},500,null,500,{"$f":"ROUND((((($C$5-$D$5)/(LN(($C$5-$E$5)/($D$5-$E$5))))/49.8328865456397)^vstupy!P38)*vstupy!P30*$I$5,0)","v":342},{"$f":"ROUND((((($C$5-$D$5)/(LN(($C$5-$E$5)/($D$5-$E$5))))/49.8328865456397)^vstupy!Q38)*vstupy!Q30*$I$5,0)","v":440},{"$f":"ROUND((((($C$5-$D$5)/(LN(($C$5-$E$5)/($D$5-$E$5))))/49.8328865456397)^vstupy!R38)*vstupy!R30*$I$5,0)","v":601},{"$f":"ROUND((((($C$5-$D$5)/(LN(($C$5-$E$5)/($D$5-$E$5))))/49.8328865456397)^vstupy!S38)*vstupy!S30*$I$5,0)","v":747},{"$f":"ROUND((((($C$5-$D$5)/(LN(($C$5-$E$5)/($D$5-$E$5))))/49.8328865456397)^vstupy!T38)*vstupy!T30*$I$5,0)","v":921}]
[null,600,{"$f":"ROUND((((($C$5-$D$5)/(LN(($C$5-$E$5)/($D$5-$E$5))))/49.8328865456397)^vstupy!C39)*vstupy!C31*$I$5,0)","v":370},{"$f":"ROUND((((($C$5-$D$5)/(LN(($C$5-$E$5)/($D$5-$E$5))))/49.8328865456397)^vstupy!D39)*vstupy!D31*$I$5,0)","v":475},{"$f":"ROUND((((($C$5-$D$5)/(LN(($C$5-$E$5)/($D$5-$E$5))))/49.8328865456397)^vstupy!E39)*vstupy!E31*$I$5,0)","v":650},{"$f":"ROUND((((($C$5-$D$5)/(LN(($C$5-$E$5)/($D$5-$E$5))))/49.8328865456397)^vstupy!F39)*vstupy!F31*$I$5,0)","v":808},{"$f":"ROUND((((($C$5-$D$5)/(LN(($C$5-$E$5)/($D$5-$E$5))))/49.8328865456397)^vstupy!G39)*vstupy!G31*$I$5,0)","v":996},{"$f":"ROUND((((($C$5-$D$5)/(LN(($C$5-$E$5)/($D$5-$E$5))))/49.8328865456397)^vstupy!H39)*vstupy!H31*$I$5,0)","v":370},{"$f":"ROUND((((($C$5-$D$5)/(LN(($C$5-$E$5)/($D$5-$E$5))))/49.8328865456397)^vstupy!I39)*vstupy!I31*$I$5,0)","v":475},{"$f":"ROUND((((($C$5-$D$5)/(LN(($C$5-$E$5)/($D$5-$E$5))))/49.8328865456397)^vstupy!J39)*vstupy!J31*$I$5,0)","v":650},{"$f":"ROUND((((($C$5-$D$5)/(LN(($C$5-$E$5)/($D$5-$E$5))))/49.8328865456397)^vstupy!K39)*vstupy!K31*$I$5,0)","v":808},{"$f":"ROUND((((($C$5-$D$5)/(LN(($C$5-$E$5)/($D$5-$E$5))))/49.8328865456397)^vstupy!L39)*vstupy!L31*$I$5,0)","v":996},600,null,600,{"$f":"ROUND((((($C$5-$D$5)/(LN(($C$5-$E$5)/($D$5-$E$5))))/49.8328865456397)^vstupy!P39)*vstupy!P31*$I$5,0)","v":400},{"$f":"ROUND((((($C$5-$D$5)/(LN(($C$5-$E$5)/($D$5-$E$5))))/49.8328865456397)^vstupy!Q39)*vstupy!Q31*$I$5,0)","v":515},{"$f":"ROUND((((($C$5-$D$5)/(LN(($C$5-$E$5)/($D$5-$E$5))))/49.8328865456397)^vstupy!R39)*vstupy!R31*$I$5,0)","v":703},{"$f":"ROUND((((($C$5-$D$5)/(LN(($C$5-$E$5)/($D$5-$E$5))))/49.8328865456397)^vstupy!S39)*vstupy!S31*$I$5,0)","v":874},{"$f":"ROUND((((($C$5-$D$5)/(LN(($C$5-$E$5)/($D$5-$E$5))))/49.8328865456397)^vstupy!T39)*vstupy!T31*$I$5,0)","v":1078},null,null,null,null,null,600]
[null,750,{"$f":"ROUND((((($C$5-$D$5)/(LN(($C$5-$E$5)/($D$5-$E$5))))/49.8328865456397)^vstupy!C40)*vstupy!C32*$I$5,0)","v":450},{"$f":"ROUND((((($C$5-$D$5)/(LN(($C$5-$E$5)/($D$5-$E$5))))/49.8328865456397)^vstupy!D40)*vstupy!D32*$I$5,0)","v":579},{"$f":"ROUND((((($C$5-$D$5)/(LN(($C$5-$E$5)/($D$5-$E$5))))/49.8328865456397)^vstupy!E40)*vstupy!E32*$I$5,0)","v":791},{"$f":"ROUND((((($C$5-$D$5)/(LN(($C$5-$E$5)/($D$5-$E$5))))/49.8328865456397)^vstupy!F40)*vstupy!F32*$I$5,0)","v":984},{"$f":"ROUND((((($C$5-$D$5)/(LN(($C$5-$E$5)/($D$5-$E$5))))/49.8328865456397)^vstupy!G40)*vstupy!G32*$I$5,0)","v":1213},{"$f":"ROUND((((($C$5-$D$5)/(LN(($C$5-$E$5)/($D$5-$E$5))))/49.8328865456397)^vstupy!H40)*vstupy!H32*$I$5,0)","v":450},{"$f":"ROUND((((($C$5-$D$5)/(LN(($C$5-$E$5)/($D$5-$E$5))))/49.8328865456397)^vstupy!I40)*vstupy!I32*$I$5,0)","v":579},{"$f":"ROUND((((($C$5-$D$5)/(LN(($C$5-$E$5)/($D$5-$E$5))))/49.8328865456397)^vstupy!J40)*vstupy!J32*$I$5,0)","v":791},{"$f":"ROUND((((($C$5-$D$5)/(LN(($C$5-$E$5)/($D$5-$E$5))))/49.8328865456397)^vstupy!K40)*vstupy!K32*$I$5,0)","v":984},{"$f":"ROUND((((($C$5-$D$5)/(LN(($C$5-$E$5)/($D$5-$E$5))))/49.8328865456397)^vstupy!L40)*vstupy!L32*$I$5,0)","v":1213},750,null,750,{"$f":"ROUND((((($C$5-$D$5)/(LN(($C$5-$E$5)/($D$5-$E$5))))/49.8328865456397)^vstupy!P40)*vstupy!P32*$I$5,0)","v":485},{"$f":"ROUND((((($C$5-$D$5)/(LN(($C$5-$E$5)/($D$5-$E$5))))/49.8328865456397)^vstupy!Q40)*vstupy!Q32*$I$5,0)","v":624},{"$f":"ROUND((((($C$5-$D$5)/(LN(($C$5-$E$5)/($D$5-$E$5))))/49.8328865456397)^vstupy!R40)*vstupy!R32*$I$5,0)","v":852},{"$f":"ROUND((((($C$5-$D$5)/(LN(($C$5-$E$5)/($D$5-$E$5))))/49.8328865456397)^vstupy!S40)*vstupy!S32*$I$5,0)","v":1060},{"$f":"ROUND((((($C$5-$D$5)/(LN(($C$5-$E$5)/($D$5-$E$5))))/49.8328865456397)^vstupy!T40)*vstupy!T32*$I$5,0)","v":1307},null,null,null,null,null,750]
[]
[null,null,"KORALUX LINEAR CLASSIC",null,null,null,null,"KORALUX LINEAR CLASSIC - M",null,null,null,null,null,null,null,"KORALUX LINEAR CLASSIC",null,null,null,null,"KORALUX LINEAR CLASSIC - M"]
[null,"Délka L","Výška H [mm]",null,null,null,null,"Výška H [mm]",null,null,null,null,"Délka L",null,"Délka L","Výška H [mm]",null,null,null,null,"Výška H [mm]",null,null,null,null,"Délka L"]
[null,"[mm]",700,900,1220,1500,1820,700,900,1220,1500,1820,"[mm]",null,"[mm]",700,900,1220,1500,1820,700,900,1220,1500,1820,"[mm]"]
[null,450,{"$f":"ROUND((((($C$5-$D$5)/(LN(($C$5-$E$5)/($D$5-$E$5))))/49.8328865456397)^vstupy!C53)*vstupy!C45*$I$5,0)","v":255},{"$f":"ROUND((((($C$5-$D$5)/(LN(($C$5-$E$5)/($D$5-$E$5))))/49.8328865456397)^vstupy!D53)*vstupy!D45*$I$5,0)","v":333},{"$f":"ROUND((((($C$5-$D$5)/(LN(($C$5-$E$5)/($D$5-$E$5))))/49.8328865456397)^vstupy!E53)*vstupy!E45*$I$5,0)","v":462},{"$f":"ROUND((((($C$5-$D$5)/(LN(($C$5-$E$5)/($D$5-$E$5))))/49.8328865456397)^vstupy!F53)*vstupy!F45*$I$5,0)","v":581},{"$f":"ROUND((((($C$5-$D$5)/(LN(($C$5-$E$5)/($D$5-$E$5))))/49.8328865456397)^vstupy!G53)*vstupy!G45*$I$5,0)","v":725},{"$f":"ROUND((((($C$5-$D$5)/(LN(($C$5-$E$5)/($D$5-$E$5))))/49.8328865456397)^vstupy!H53)*vstupy!H45*$I$5,0)","v":255},{"$f":"ROUND((((($C$5-$D$5)/(LN(($C$5-$E$5)/($D$5-$E$5))))/49.8328865456397)^vstupy!I53)*vstupy!I45*$I$5,0)","v":333},{"$f":"ROUND((((($C$5-$D$5)/(LN(($C$5-$E$5)/($D$5-$E$5))))/49.8328865456397)^vstupy!J53)*vstupy!J45*$I$5,0)","v":462},{"$f":"ROUND((((($C$5-$D$5)/(LN(($C$5-$E$5)/($D$5-$E$5))))/49.8328865456397)^vstupy!K53)*vstupy!K45*$I$5,0)","v":581},{"$f":"ROUND((((($C$5-$D$5)/(LN(($C$5-$E$5)/($D$5-$E$5))))/49.8328865456397)^vstupy!L53)*vstupy!L45*$I$5,0)","v":725},450,null,450,{"$f":"ROUND((((($C$5-$D$5)/(LN(($C$5-$E$5)/($D$5-$E$5))))/49.8328865456397)^vstupy!P53)*vstupy!P45*$I$5,0)","v":291},{"$f":"ROUND((((($C$5-$D$5)/(LN(($C$5-$E$5)/($D$5-$E$5))))/49.8328865456397)^vstupy!Q53)*vstupy!Q45*$I$5,0)","v":378},{"$f":"ROUND((((($C$5-$D$5)/(LN(($C$5-$E$5)/($D$5-$E$5))))/49.8328865456397)^vstupy!R53)*vstupy!R45*$I$5,0)","v":519},{"$f":"ROUND((((($C$5-$D$5)/(LN(($C$5-$E$5)/($D$5-$E$5))))/49.8328865456397)^vstupy!S53)*vstupy!S45*$I$5,0)","v":643},{"$f":"ROUND((((($C$5-$D$5)/(LN(($C$5-$E$5)/($D$5-$E$5))))/49.8328865456397)^vstupy!T53)*vstupy!T45*$I$5,0)","v":786},null,null,null,null,null,450]
[null,500,{"$f":"ROUND((((($C$5-$D$5)/(LN(($C$5-$E$5)/($D$5-$E$5))))/49.8328865456397)^vstupy!C54)*vstupy!C46*$I$5,0)","v":280},{"$f":"ROUND((((($C$5-$D$5)/(LN(($C$5-$E$5)/($D$5-$E$5))))/49.8328865456397)^vstupy!D54)*vstupy!D46*$I$5,0)","v":365},{"$f":"ROUND((((($C$5-$D$5)/(LN(($C$5-$E$5)/($D$5-$E$5))))/49.8328865456397)^vstupy!E54)*vstupy!E46*$I$5,0)","v":507},{"$f":"ROUND((((($C$5-$D$5)/(LN(($C$5-$E$5)/($D$5-$E$5))))/49.8328865456397)^vstupy!F54)*vstupy!F46*$I$5,0)","v":638},{"$f":"ROUND((((($C$5-$D$5)/(LN(($C$5-$E$5)/($D$5-$E$5))))/49.8328865456397)^vstupy!G54)*vstupy!G46*$I$5,0)","v":795},{"$f":"ROUND((((($C$5-$D$5)/(LN(($C$5-$E$5)/($D$5-$E$5))))/49.8328865456397)^vstupy!H54)*vstupy!H46*$I$5,0)","v":280},{"$f":"ROUND((((($C$5-$D$5)/(LN(($C$5-$E$5)/($D$5-$E$5))))/49.8328865456397)^vstupy!I54)*vstupy!I46*$I$5,0)","v":365},{"$f":"ROUND((((($C$5-$D$5)/(LN(($C$5-$E$5)/($D$5-$E$5))))/49.8328865456397)^vstupy!J54)*vstupy!J46*$I$5,0)","v":507},{"$f":"ROUND((((($C$5-$D$5)/(LN(($C$5-$E$5)/($D$5-$E$5))))/49.8328865456397)^vstupy!K54)*vstupy!K46*$I$5,0)","v":638},{"$f":"ROUND((((($C$5-$D$5)/(LN(($C$5-$E$5)/($D$5-$E$5))))/49.8328865456397)^vstupy!L54)*vstupy!L46*$I$5,0)","v":795},500,null,500,{"$f":"ROUND((((($C$5-$D$5)/(LN(($C$5-$E$5)/($D$5-$E$5))))/49.8328865456397)^vstupy!P54)*vstupy!P46*$I$5,0)","v":318},{"$f":"ROUND((((($C$5-$D$5)/(LN(($C$5-$E$5)/($D$5-$E$5))))/49.8328865456397)^vstupy!Q54)*vstupy!Q46*$I$5,0)","v":413},{"$f":"ROUND((((($C$5-$D$5)/(LN(($C$5-$E$5)/($D$5-$E$5))))/49.8328865456397)^vstupy!R54)*vstupy!R46*$I$5,0)","v":567},{"$f":"ROUND((((($C$5-$D$5)/(LN(($C$5-$E$5)/($D$5-$E$5))))/49.8328865456397)^vstupy!S54)*vstupy!S46*$I$5,0)","v":703},{"$f":"ROUND((((($C$5-$D$5)/(LN(($C$5-$E$5)/($D$5-$E$5))))/49.8328865456397)^vstupy!T54)*vstupy!T46*$I$5,0)","v":859},null,null,null,null,null,500]
[null,600,{"$f":"ROUND((((($C$5-$D$5)/(LN(($C$5-$E$5)/($D$5-$E$5))))/49.8328865456397)^vstupy!C55)*vstupy!C47*$I$5,0)","v":329},{"$f":"ROUND((((($C$5-$D$5)/(LN(($C$5-$E$5)/($D$5-$E$5))))/49.8328865456397)^vstupy!D55)*vstupy!D47*$I$5,0)","v":429},{"$f":"ROUND((((($C$5-$D$5)/(LN(($C$5-$E$5)/($D$5-$E$5))))/49.8328865456397)^vstupy!E55)*vstupy!E47*$I$5,0)","v":596},{"$f":"ROUND((((($C$5-$D$5)/(LN(($C$5-$E$5)/($D$5-$E$5))))/49.8328865456397)^vstupy!F55)*vstupy!F47*$I$5,0)","v":750},{"$f":"ROUND((((($C$5-$D$5)/(LN(($C$5-$E$5)/($D$5-$E$5))))/49.8328865456397)^vstupy!G55)*vstupy!G47*$I$5,0)","v":934},{"$f":"ROUND((((($C$5-$D$5)/(LN(($C$5-$E$5)/($D$5-$E$5))))/49.8328865456397)^vstupy!H55)*vstupy!H47*$I$5,0)","v":329},{"$f":"ROUND((((($C$5-$D$5)/(LN(($C$5-$E$5)/($D$5-$E$5))))/49.8328865456397)^vstupy!I55)*vstupy!I47*$I$5,0)","v":429},{"$f":"ROUND((((($C$5-$D$5)/(LN(($C$5-$E$5)/($D$5-$E$5))))/49.8328865456397)^vstupy!J55)*vstupy!J47*$I$5,0)","v":596},{"$f":"ROUND((((($C$5-$D$5)/(LN(($C$5-$E$5)/($D$5-$E$5))))/49.8328865456397)^vstupy!K55)*vstupy!K47*$I$5,0)","v":750},{"$f":"ROUND((((($C$5-$D$5)/(LN(($C$5-$E$5)/($D$5-$E$5))))/49.8328865456397)^vstupy!L55)*vstupy!L47*$I$5,0)","v":934},600,null,600,{"$f":"ROUND((((($C$5-$D$5)/(LN(($C$5-$E$5)/($D$5-$E$5))))/49.8328865456397)^vstupy!P55)*vstupy!P47*$I$5,0)","v":372},{"$f":"ROUND((((($C$5-$D$5)/(LN(($C$5-$E$5)/($D$5-$E$5))))/49.8328865456397)^vstupy!Q55)*vstupy!Q47*$I$5,0)","v":482},{"$f":"ROUND((((($C$5-$D$5)/(LN(($C$5-$E$5)/($D$5-$E$5))))/49.8328865456397)^vstupy!R55)*vstupy!R47*$I$5,0)","v":662},{"$f":"ROUND((((($C$5-$D$5)/(LN(($C$5-$E$5)/($D$5-$E$5))))/49.8328865456397)^vstupy!S55)*vstupy!S47*$I$5,0)","v":820},{"$f":"ROUND((((($C$5-$D$5)/(LN(($C$5-$E$5)/($D$5-$E$5))))/49.8328865456397)^vstupy!T55)*vstupy!T47*$I$5,0)","v":1003},null,null,null,null,null,600]
[null,750,{"$f":"ROUND((((($C$5-$D$5)/(LN(($C$5-$E$5)/($D$5-$E$5))))/49.8328865456397)^vstupy!C56)*vstupy!C48*$I$5,0)","v":400},{"$f":"ROUND((((($C$5-$D$5)/(LN(($C$5-$E$5)/($D$5-$E$5))))/49.8328865456397)^vstupy!D56)*vstupy!D48*$I$5,0)","v":522},{"$f":"ROUND((((($C$5-$D$5)/(LN(($C$5-$E$5)/($D$5-$E$5))))/49.8328865456397)^vstupy!E56)*vstupy!E48*$I$5,0)","v":726},{"$f":"ROUND((((($C$5-$D$5)/(LN(($C$5-$E$5)/($D$5-$E$5))))/49.8328865456397)^vstupy!F56)*vstupy!F48*$I$5,0)","v":913},{"$f":"ROUND((((($C$5-$D$5)/(LN(($C$5-$E$5)/($D$5-$E$5))))/49.8328865456397)^vstupy!G56)*vstupy!G48*$I$5,0)","v":1138},{"$f":"ROUND((((($C$5-$D$5)/(LN(($C$5-$E$5)/($D$5-$E$5))))/49.8328865456397)^vstupy!H56)*vstupy!H48*$I$5,0)","v":400},{"$f":"ROUND((((($C$5-$D$5)/(LN(($C$5-$E$5)/($D$5-$E$5))))/49.8328865456397)^vstupy!I56)*vstupy!I48*$I$5,0)","v":522},{"$f":"ROUND((((($C$5-$D$5)/(LN(($C$5-$E$5)/($D$5-$E$5))))/49.8328865456397)^vstupy!J56)*vstupy!J48*$I$5,0)","v":726},{"$f":"ROUND((((($C$5-$D$5)/(LN(($C$5-$E$5)/($D$5-$E$5))))/49.8328865456397)^vstupy!K56)*vstupy!K48*$I$5,0)","v":913},{"$f":"ROUND((((($C$5-$D$5)/(LN(($C$5-$E$5)/($D$5-$E$5))))/49.8328865456397)^vstupy!L56)*vstupy!L48*$I$5,0)","v":1138},750,null,750,{"$f":"ROUND((((($C$5-$D$5)/(LN(($C$5-$E$5)/($D$5-$E$5))))/49.8328865456397)^vstupy!P56)*vstupy!P48*$I$5,0)","v":449},{"$f":"ROUND((((($C$5-$D$5)/(LN(($C$5-$E$5)/($D$5-$E$5))))/49.8328865456397)^vstupy!Q56)*vstupy!Q48*$I$5,0)","v":583},{"$f":"ROUND((((($C$5-$D$5)/(LN(($C$5-$E$5)/($D$5-$E$5))))/49.8328865456397)^vstupy!R56)*vstupy!R48*$I$5,0)","v":799},{"$f":"ROUND((((($C$5-$D$5)/(LN(($C$5-$E$5)/($D$5-$E$5))))/49.8328865456397)^vstupy!S56)*vstupy!S48*$I$5,0)","v":991},{"$f":"ROUND((((($C$5-$D$5)/(LN(($C$5-$E$5)/($D$5-$E$5))))/49.8328865456397)^vstupy!T56)*vstupy!T48*$I$5,0)","v":1211},null,null,null,null,null,750]
[]
[null,null,"KORALUX STANDARD",null,null,null,null,null,null,null,null,null,null,null,null,"KORALUX STANDARD"]
[null,"Délka L","Výška H [mm]",null,null,null,null,null,null,null,null,null,null,null,"Délka L","Výška H [mm]"]
[null,"[mm]",700,900,1220,1500,null,null,null,null,null,null,null,null,"[mm]",700,900,1220,1500]
[null,400,{"$f":"ROUND((((($C$5-$D$5)/(LN(($C$5-$E$5)/($D$5-$E$5))))/49.8328865456397)^vstupy!C68)*vstupy!C61*$I$5,0)","v":198},{"$f":"ROUND((((($C$5-$D$5)/(LN(($C$5-$E$5)/($D$5-$E$5))))/49.8328865456397)^vstupy!D68)*vstupy!D61*$I$5,0)","v":254},{"$f":"ROUND((((($C$5-$D$5)/(LN(($C$5-$E$5)/($D$5-$E$5))))/49.8328865456397)^vstupy!E68)*vstupy!E61*$I$5,0)","v":345},{"$f":"ROUND((((($C$5-$D$5)/(LN(($C$5-$E$5)/($D$5-$E$5))))/49.8328865456397)^vstupy!F68)*vstupy!F61*$I$5,0)","v":427},null,null,null,null,null,null,null,null,400,{"$f":"ROUND((((($C$5-$D$5)/(LN(($C$5-$E$5)/($D$5-$E$5))))/49.8328865456397)^vstupy!P68)*vstupy!P61*$I$5,0)","v":213},{"$f":"ROUND((((($C$5-$D$5)/(LN(($C$5-$E$5)/($D$5-$E$5))))/49.8328865456397)^vstupy!Q68)*vstupy!Q61*$I$5,0)","v":275},{"$f":"ROUND((((($C$5-$D$5)/(LN(($C$5-$E$5)/($D$5-$E$5))))/49.8328865456397)^vstupy!R68)*vstupy!R61*$I$5,0)","v":373},{"$f":"ROUND((((($C$5-$D$5)/(LN(($C$5-$E$5)/($D$5-$E$5))))/49.8328865456397)^vstupy!S68)*vstupy!S61*$I$5,0)","v":458}]
[null,500,{"$f":"ROUND((((($C$5-$D$5)/(LN(($C$5-$E$5)/($D$5-$E$5))))/49.8328865456397)^vstupy!C69)*vstupy!C62*$I$5,0)","v":231},{"$f":"ROUND((((($C$5-$D$5)/(LN(($C$5-$E$5)/($D$5-$E$5))))/49.8328865456397)^vstupy!D69)*vstupy!D62*$I$5,0)","v":297},{"$f":"ROUND((((($C$5-$D$5)/(LN(($C$5-$E$5)/($D$5-$E$5))))/49.8328865456397)^vstupy!E69)*vstupy!E62*$I$5,0)","v":403},{"$f":"ROUND((((($C$5-$D$5)/(LN(($C$5-$E$5)/($D$5-$E$5))))/49.8328865456397)^vstupy!F69)*vstupy!F62*$I$5,0)","v":499},null,null,null,null,null,null,null,null,500,{"$f":"ROUND((((($C$5-$D$5)/(LN(($C$5-$E$5)/($D$5-$E$5))))/49.8328865456397)^vstupy!P69)*vstupy!P62*$I$5,0)","v":249},{"$f":"ROUND((((($C$5-$D$5)/(LN(($C$5-$E$5)/($D$5-$E$5))))/49.8328865456397)^vstupy!Q69)*vstupy!Q62*$I$5,0)","v":322},{"$f":"ROUND((((($C$5-$D$5)/(LN(($C$5-$E$5)/($D$5-$E$5))))/49.8328865456397)^vstupy!R69)*vstupy!R62*$I$5,0)","v":436},{"$f":"ROUND((((($C$5-$D$5)/(LN(($C$5-$E$5)/($D$5-$E$5))))/49.8328865456397)^vstupy!S69)*vstupy!S62*$I$5,0)","v":536}]
[null,600,{"$f":"ROUND((((($C$5-$D$5)/(LN(($C$5-$E$5)/($D$5-$E$5))))/49.8328865456397)^vstupy!C70)*vstupy!C63*$I$5,0)","v":263},{"$f":"ROUND((((($C$5-$D$5)/(LN(($C$5-$E$5)/($D$5-$E$5))))/49.8328865456397)^vstupy!D70)*vstupy!D63*$I$5,0)","v":337},{"$f":"ROUND((((($C$5-$D$5)/(LN(($C$5-$E$5)/($D$5-$E$5))))/49.8328865456397)^vstupy!E70)*vstupy!E63*$I$5,0)","v":458},{"$f":"ROUND((((($C$5-$D$5)/(LN(($C$5-$E$5)/($D$5-$E$5))))/49.8328865456397)^vstupy!F70)*vstupy!F63*$I$5,0)","v":567},null,null,null,null,null,null,null,null,600,{"$f":"ROUND((((($C$5-$D$5)/(LN(($C$5-$E$5)/($D$5-$E$5))))/49.8328865456397)^vstupy!P70)*vstupy!P63*$I$5,0)","v":283},{"$f":"ROUND((((($C$5-$D$5)/(LN(($C$5-$E$5)/($D$5-$E$5))))/49.8328865456397)^vstupy!Q70)*vstupy!Q63*$I$5,0)","v":365},{"$f":"ROUND((((($C$5-$D$5)/(LN(($C$5-$E$5)/($D$5-$E$5))))/49.8328865456397)^vstupy!R70)*vstupy!R63*$I$5,0)","v":496},{"$f":"ROUND((((($C$5-$D$5)/(LN(($C$5-$E$5)/($D$5-$E$5))))/49.8328865456397)^vstupy!S70)*vstupy!S63*$I$5,0)","v":609}]
[]
[null,null,"KORALUX LINEAR EXCLUSIVE - M",null,null,null,null,null,null,null,null,null,null,null,null,"KORALUX LINEAR EXCLUSIVE - M"]
[null,"Délka L","Výška H [mm]",null,null,null,null,null,null,null,null,null,null,null,"Délka L","Výška H [mm]"]
[null,"[mm]",{"$f":"logic!$L$4","v":"Délka"},1220,1500,1820,null,null,null,null,null,null,null,null,"[mm]",900,1220,1500,1820]
[null,450,{"$f":"ROUND((((($C$5-$D$5)/(LN(($C$5-$E$5)/($D$5-$E$5))))/49.8328865456397)^vstupy!C82)*vstupy!C75*$I$5,0)","v":249},{"$f":"ROUND((((($C$5-$D$5)/(LN(($C$5-$E$5)/($D$5-$E$5))))/49.8328865456397)^vstupy!D82)*vstupy!D75*$I$5,0)","v":338},{"$f":"ROUND((((($C$5-$D$5)/(LN(($C$5-$E$5)/($D$5-$E$5))))/49.8328865456397)^vstupy!E82)*vstupy!E75*$I$5,0)","v":419},{"$f":"ROUND((((($C$5-$D$5)/(LN(($C$5-$E$5)/($D$5-$E$5))))/49.8328865456397)^vstupy!F82)*vstupy!F75*$I$5,0)","v":516},null,null,null,null,null,null,null,null,450]
[null,600,{"$f":"ROUND((((($C$5-$D$5)/(LN(($C$5-$E$5)/($D$5-$E$5))))/49.8328865456397)^vstupy!C83)*vstupy!C76*$I$5,0)","v":319},{"$f":"ROUND((((($C$5-$D$5)/(LN(($C$5-$E$5)/($D$5-$E$5))))/49.8328865456397)^vstupy!D83)*vstupy!D76*$I$5,0)","v":433},{"$f":"ROUND((((($C$5-$D$5)/(LN(($C$5-$E$5)/($D$5-$E$5))))/49.8328865456397)^vstupy!E83)*vstupy!E76*$I$5,0)","v":537},{"$f":"ROUND((((($C$5-$D$5)/(LN(($C$5-$E$5)/($D$5-$E$5))))/49.8328865456397)^vstupy!F83)*vstupy!F76*$I$5,0)","v":662},null,null,null,null,null,null,null,null,600]
[null,750,{"$f":"ROUND((((($C$5-$D$5)/(LN(($C$5-$E$5)/($D$5-$E$5))))/49.8328865456397)^vstupy!C84)*vstupy!C77*$I$5,0)","v":387},{"$f":"ROUND((((($C$5-$D$5)/(LN(($C$5-$E$5)/($D$5-$E$5))))/49.8328865456397)^vstupy!D84)*vstupy!D77*$I$5,0)","v":526},{"$f":"ROUND((((($C$5-$D$5)/(LN(($C$5-$E$5)/($D$5-$E$5))))/49.8328865456397)^vstupy!E84)*vstupy!E77*$I$5,0)","v":652},{"$f":"ROUND((((($C$5-$D$5)/(LN(($C$5-$E$5)/($D$5-$E$5))))/49.8328865456397)^vstupy!F84)*vstupy!F77*$I$5,0)","v":802},null,null,null,null,null,null,null,null,750]
[]
[null,null,"KORALUX RONDO MAX",null,null,null,null,"KORALUX RONDO MAX - M",null,null,null,null,null,null,null,"KORALUX RONDO MAX",null,null,null,null,"KORALUX RONDO MAX - M"]
[null,"Délka L","Výška H [mm]",null,null,null,null,"Výška H [mm]",null,null,null,null,"Délka L",null,"Délka L","Výška H [mm]",null,null,null,null,"Výška H [mm]",null,null,null,null,"Délka L"]
[null,"[mm]",700,900,1220,1500,1820,700,900,1220,1500,1820,"[mm]",null,"[mm]",700,900,1220,1500,1820,700,900,1220,1500,1820,"[mm]"]
[null,450,{"$f":"ROUND((((($C$5-$D$5)/(LN(($C$5-$E$5)/($D$5-$E$5))))/49.8328865456397)^vstupy!C96)*vstupy!C89*$I$5,0)","v":335},{"$f":"ROUND((((($C$5-$D$5)/(LN(($C$5-$E$5)/($D$5-$E$5))))/49.8328865456397)^vstupy!D96)*vstupy!D89*$I$5,0)","v":432},{"$f":"ROUND((((($C$5-$D$5)/(LN(($C$5-$E$5)/($D$5-$E$5))))/49.8328865456397)^vstupy!E96)*vstupy!E89*$I$5,0)","v":589},{"$f":"ROUND((((($C$5-$D$5)/(LN(($C$5-$E$5)/($D$5-$E$5))))/49.8328865456397)^vstupy!F96)*vstupy!F89*$I$5,0)","v":725},{"$f":"ROUND((((($C$5-$D$5)/(LN(($C$5-$E$5)/($D$5-$E$5))))/49.8328865456397)^vstupy!G96)*vstupy!G89*$I$5,0)","v":879},{"$f":"ROUND((((($C$5-$D$5)/(LN(($C$5-$E$5)/($D$5-$E$5))))/49.8328865456397)^vstupy!H96)*vstupy!H89*$I$5,0)","v":335},{"$f":"ROUND((((($C$5-$D$5)/(LN(($C$5-$E$5)/($D$5-$E$5))))/49.8328865456397)^vstupy!I96)*vstupy!I89*$I$5,0)","v":432},{"$f":"ROUND((((($C$5-$D$5)/(LN(($C$5-$E$5)/($D$5-$E$5))))/49.8328865456397)^vstupy!J96)*vstupy!J89*$I$5,0)","v":589},{"$f":"ROUND((((($C$5-$D$5)/(LN(($C$5-$E$5)/($D$5-$E$5))))/49.8328865456397)^vstupy!K96)*vstupy!K89*$I$5,0)","v":725},{"$f":"ROUND((((($C$5-$D$5)/(LN(($C$5-$E$5)/($D$5-$E$5))))/49.8328865456397)^vstupy!L96)*vstupy!L89*$I$5,0)","v":879},450,null,450,{"$f":"ROUND((((($C$5-$D$5)/(LN(($C$5-$E$5)/($D$5-$E$5))))/49.8328865456397)^vstupy!P96)*vstupy!P89*$I$5,0)","v":361},{"$f":"ROUND((((($C$5-$D$5)/(LN(($C$5-$E$5)/($D$5-$E$5))))/49.8328865456397)^vstupy!Q96)*vstupy!Q89*$I$5,0)","v":462},{"$f":"ROUND((((($C$5-$D$5)/(LN(($C$5-$E$5)/($D$5-$E$5))))/49.8328865456397)^vstupy!R96)*vstupy!R89*$I$5,0)","v":625},{"$f":"ROUND((((($C$5-$D$5)/(LN(($C$5-$E$5)/($D$5-$E$5))))/49.8328865456397)^vstupy!S96)*vstupy!S89*$I$5,0)","v":771},{"$f":"ROUND((((($C$5-$D$5)/(LN(($C$5-$E$5)/($D$5-$E$5))))/49.8328865456397)^vstupy!T96)*vstupy!T89*$I$5,0)","v":942},null,null,null,null,null,450]
[null,600,{"$f":"ROUND((((($C$5-$D$5)/(LN(($C$5-$E$5)/($D$5-$E$5))))/49.8328865456397)^vstupy!C97)*vstupy!C90*$I$5,0)","v":444},{"$f":"ROUND((((($C$5-$D$5)/(LN(($C$5-$E$5)/($D$5-$E$5))))/49.8328865456397)^vstupy!D97)*vstupy!D90*$I$5,0)","v":574},{"$f":"ROUND((((($C$5-$D$5)/(LN(($C$5-$E$5)/($D$5-$E$5))))/49.8328865456397)^vstupy!E97)*vstupy!E90*$I$5,0)","v":781},{"$f":"ROUND((((($C$5-$D$5)/(LN(($C$5-$E$5)/($D$5-$E$5))))/49.8328865456397)^vstupy!F97)*vstupy!F90*$I$5,0)","v":962},{"$f":"ROUND((((($C$5-$D$5)/(LN(($C$5-$E$5)/($D$5-$E$5))))/49.8328865456397)^vstupy!G97)*vstupy!G90*$I$5,0)","v":1166},{"$f":"ROUND((((($C$5-$D$5)/(LN(($C$5-$E$5)/($D$5-$E$5))))/49.8328865456397)^vstupy!H97)*vstupy!H90*$I$5,0)","v":444},{"$f":"ROUND((((($C$5-$D$5)/(LN(($C$5-$E$5)/($D$5-$E$5))))/49.8328865456397)^vstupy!I97)*vstupy!I90*$I$5,0)","v":574},{"$f":"ROUND((((($C$5-$D$5)/(LN(($C$5-$E$5)/($D$5-$E$5))))/49.8328865456397)^vstupy!J97)*vstupy!J90*$I$5,0)","v":781},{"$f":"ROUND((((($C$5-$D$5)/(LN(($C$5-$E$5)/($D$5-$E$5))))/49.8328865456397)^vstupy!K97)*vstupy!K90*$I$5,0)","v":962},{"$f":"ROUND((((($C$5-$D$5)/(LN(($C$5-$E$5)/($D$5-$E$5))))/49.8328865456397)^vstupy!L97)*vstupy!L90*$I$5,0)","v":1166},600,null,600,{"$f":"ROUND((((($C$5-$D$5)/(LN(($C$5-$E$5)/($D$5-$E$5))))/49.8328865456397)^vstupy!P97)*vstupy!P90*$I$5,0)","v":480},{"$f":"ROUND((((($C$5-$D$5)/(LN(($C$5-$E$5)/($D$5-$E$5))))/49.8328865456397)^vstupy!Q97)*vstupy!Q90*$I$5,0)","v":614},{"$f":"ROUND((((($C$5-$D$5)/(LN(($C$5-$E$5)/($D$5-$E$5))))/49.8328865456397)^vstupy!R97)*vstupy!R90*$I$5,0)","v":832},{"$f":"ROUND((((($C$5-$D$5)/(LN(($C$5-$E$5)/($D$5-$E$5))))/49.8328865456397)^vstupy!S97)*vstupy!S90*$I$5,0)","v":1026},{"$f":"ROUND((((($C$5-$D$5)/(LN(($C$5-$E$5)/($D$5-$E$5))))/49.8328865456397)^vstupy!T97)*vstupy!T90*$I$5,0)","v":1253},null,null,null,null,null,600]
[null,750,{"$f":"ROUND((((($C$5-$D$5)/(LN(($C$5-$E$5)/($D$5-$E$5))))/49.8328865456397)^vstupy!C98)*vstupy!C91*$I$5,0)","v":553},{"$f":"ROUND((((($C$5-$D$5)/(LN(($C$5-$E$5)/($D$5-$E$5))))/49.8328865456397)^vstupy!D98)*vstupy!D91*$I$5,0)","v":714},{"$f":"ROUND((((($C$5-$D$5)/(LN(($C$5-$E$5)/($D$5-$E$5))))/49.8328865456397)^vstupy!E98)*vstupy!E91*$I$5,0)","v":973},{"$f":"ROUND((((($C$5-$D$5)/(LN(($C$5-$E$5)/($D$5-$E$5))))/49.8328865456397)^vstupy!F98)*vstupy!F91*$I$5,0)","v":1197},{"$f":"ROUND((((($C$5-$D$5)/(LN(($C$5-$E$5)/($D$5-$E$5))))/49.8328865456397)^vstupy!G98)*vstupy!G91*$I$5,0)","v":1452},{"$f":"ROUND((((($C$5-$D$5)/(LN(($C$5-$E$5)/($D$5-$E$5))))/49.8328865456397)^vstupy!H98)*vstupy!H91*$I$5,0)","v":553},{"$f":"ROUND((((($C$5-$D$5)/(LN(($C$5-$E$5)/($D$5-$E$5))))/49.8328865456397)^vstupy!I98)*vstupy!I91*$I$5,0)","v":714},{"$f":"ROUND((((($C$5-$D$5)/(LN(($C$5-$E$5)/($D$5-$E$5))))/49.8328865456397)^vstupy!J98)*vstupy!J91*$I$5,0)","v":973},{"$f":"ROUND((((($C$5-$D$5)/(LN(($C$5-$E$5)/($D$5-$E$5))))/49.8328865456397)^vstupy!K98)*vstupy!K91*$I$5,0)","v":1197},{"$f":"ROUND((((($C$5-$D$5)/(LN(($C$5-$E$5)/($D$5-$E$5))))/49.8328865456397)^vstupy!L98)*vstupy!L91*$I$5,0)","v":1452},750,null,750,{"$f":"ROUND((((($C$5-$D$5)/(LN(($C$5-$E$5)/($D$5-$E$5))))/49.8328865456397)^vstupy!P98)*vstupy!P91*$I$5,0)","v":599},{"$f":"ROUND((((($C$5-$D$5)/(LN(($C$5-$E$5)/($D$5-$E$5))))/49.8328865456397)^vstupy!Q98)*vstupy!Q91*$I$5,0)","v":767},{"$f":"ROUND((((($C$5-$D$5)/(LN(($C$5-$E$5)/($D$5-$E$5))))/49.8328865456397)^vstupy!R98)*vstupy!R91*$I$5,0)","v":1038},{"$f":"ROUND((((($C$5-$D$5)/(LN(($C$5-$E$5)/($D$5-$E$5))))/49.8328865456397)^vstupy!S98)*vstupy!S91*$I$5,0)","v":1280},{"$f":"ROUND((((($C$5-$D$5)/(LN(($C$5-$E$5)/($D$5-$E$5))))/49.8328865456397)^vstupy!T98)*vstupy!T91*$I$5,0)","v":1564},null,null,null,null,null,750]
[]
[null,null,"KORALUX RONDO COMFORT",null,null,null,null,"KORALUX RONDO COMFORT - M",null,null,null,null,null,null,null,"KORALUX RONDO COMFORT",null,null,null,null,"KORALUX RONDO COMFORT - M"]
[null,"Délka L","Výška H [mm]",null,null,null,null,"Výška H [mm]",null,null,null,null,"Délka L",null,"Délka L","Výška H [mm]",null,null,null,null,"Výška H [mm]",null,null,null,null,"Délka L"]
[null,"[mm]",700,900,1220,1500,1820,700,900,1220,1500,1820,"[mm]",null,"[mm]",700,900,1220,1500,1820,700,900,1220,1500,1820,"[mm]"]
[null,450,{"$f":"ROUND((((($C$5-$D$5)/(LN(($C$5-$E$5)/($D$5-$E$5))))/49.8328865456397)^vstupy!C111)*vstupy!C103*$I$5,0)","v":287},{"$f":"ROUND((((($C$5-$D$5)/(LN(($C$5-$E$5)/($D$5-$E$5))))/49.8328865456397)^vstupy!D111)*vstupy!D103*$I$5,0)","v":369},{"$f":"ROUND((((($C$5-$D$5)/(LN(($C$5-$E$5)/($D$5-$E$5))))/49.8328865456397)^vstupy!E111)*vstupy!E103*$I$5,0)","v":504},{"$f":"ROUND((((($C$5-$D$5)/(LN(($C$5-$E$5)/($D$5-$E$5))))/49.8328865456397)^vstupy!F111)*vstupy!F103*$I$5,0)","v":626},{"$f":"ROUND((((($C$5-$D$5)/(LN(($C$5-$E$5)/($D$5-$E$5))))/49.8328865456397)^vstupy!G111)*vstupy!G103*$I$5,0)","v":772},{"$f":"ROUND((((($C$5-$D$5)/(LN(($C$5-$E$5)/($D$5-$E$5))))/49.8328865456397)^vstupy!H111)*vstupy!H103*$I$5,0)","v":287},{"$f":"ROUND((((($C$5-$D$5)/(LN(($C$5-$E$5)/($D$5-$E$5))))/49.8328865456397)^vstupy!I111)*vstupy!I103*$I$5,0)","v":369},{"$f":"ROUND((((($C$5-$D$5)/(LN(($C$5-$E$5)/($D$5-$E$5))))/49.8328865456397)^vstupy!J111)*vstupy!J103*$I$5,0)","v":504},{"$f":"ROUND((((($C$5-$D$5)/(LN(($C$5-$E$5)/($D$5-$E$5))))/49.8328865456397)^vstupy!K111)*vstupy!K103*$I$5,0)","v":626},{"$f":"ROUND((((($C$5-$D$5)/(LN(($C$5-$E$5)/($D$5-$E$5))))/49.8328865456397)^vstupy!L111)*vstupy!L103*$I$5,0)","v":772},450,null,450,{"$f":"ROUND((((($C$5-$D$5)/(LN(($C$5-$E$5)/($D$5-$E$5))))/49.8328865456397)^vstupy!P111)*vstupy!P103*$I$5,0)","v":312},{"$f":"ROUND((((($C$5-$D$5)/(LN(($C$5-$E$5)/($D$5-$E$5))))/49.8328865456397)^vstupy!Q111)*vstupy!Q103*$I$5,0)","v":402},{"$f":"ROUND((((($C$5-$D$5)/(LN(($C$5-$E$5)/($D$5-$E$5))))/49.8328865456397)^vstupy!R111)*vstupy!R103*$I$5,0)","v":549},{"$f":"ROUND((((($C$5-$D$5)/(LN(($C$5-$E$5)/($D$5-$E$5))))/49.8328865456397)^vstupy!S111)*vstupy!S103*$I$5,0)","v":682},{"$f":"ROUND((((($C$5-$D$5)/(LN(($C$5-$E$5)/($D$5-$E$5))))/49.8328865456397)^vstupy!T111)*vstupy!T103*$I$5,0)","v":841},null,null,null,null,null,450]
[null,500,{"$f":"ROUND((((($C$5-$D$5)/(LN(($C$5-$E$5)/($D$5-$E$5))))/49.8328865456397)^vstupy!C112)*vstupy!C104*$I$5,0)","v":315},{"$f":"ROUND((((($C$5-$D$5)/(LN(($C$5-$E$5)/($D$5-$E$5))))/49.8328865456397)^vstupy!D112)*vstupy!D104*$I$5,0)","v":405},{"$f":"ROUND((((($C$5-$D$5)/(LN(($C$5-$E$5)/($D$5-$E$5))))/49.8328865456397)^vstupy!E112)*vstupy!E104*$I$5,0)","v":553},{"$f":"ROUND((((($C$5-$D$5)/(LN(($C$5-$E$5)/($D$5-$E$5))))/49.8328865456397)^vstupy!F112)*vstupy!F104*$I$5,0)","v":687},{"$f":"ROUND((((($C$5-$D$5)/(LN(($C$5-$E$5)/($D$5-$E$5))))/49.8328865456397)^vstupy!G112)*vstupy!G104*$I$5,0)","v":848},{"$f":"ROUND((((($C$5-$D$5)/(LN(($C$5-$E$5)/($D$5-$E$5))))/49.8328865456397)^vstupy!H112)*vstupy!H104*$I$5,0)","v":315},{"$f":"ROUND((((($C$5-$D$5)/(LN(($C$5-$E$5)/($D$5-$E$5))))/49.8328865456397)^vstupy!I112)*vstupy!I104*$I$5,0)","v":405},{"$f":"ROUND((((($C$5-$D$5)/(LN(($C$5-$E$5)/($D$5-$E$5))))/49.8328865456397)^vstupy!J112)*vstupy!J104*$I$5,0)","v":553},{"$f":"ROUND((((($C$5-$D$5)/(LN(($C$5-$E$5)/($D$5-$E$5))))/49.8328865456397)^vstupy!K112)*vstupy!K104*$I$5,0)","v":687},{"$f":"ROUND((((($C$5-$D$5)/(LN(($C$5-$E$5)/($D$5-$E$5))))/49.8328865456397)^vstupy!L112)*vstupy!L104*$I$5,0)","v":848},500,null,500,{"$f":"ROUND((((($C$5-$D$5)/(LN(($C$5-$E$5)/($D$5-$E$5))))/49.8328865456397)^vstupy!P112)*vstupy!P104*$I$5,0)","v":342},{"$f":"ROUND((((($C$5-$D$5)/(LN(($C$5-$E$5)/($D$5-$E$5))))/49.8328865456397)^vstupy!Q112)*vstupy!Q104*$I$5,0)","v":440},{"$f":"ROUND((((($C$5-$D$5)/(LN(($C$5-$E$5)/($D$5-$E$5))))/49.8328865456397)^vstupy!R112)*vstupy!R104*$I$5,0)","v":601},{"$f":"ROUND((((($C$5-$D$5)/(LN(($C$5-$E$5)/($D$5-$E$5))))/49.8328865456397)^vstupy!S112)*vstupy!S104*$I$5,0)","v":747},{"$f":"ROUND((((($C$5-$D$5)/(LN(($C$5-$E$5)/($D$5-$E$5))))/49.8328865456397)^vstupy!T112)*vstupy!T104*$I$5,0)","v":921},null,null,null,null,null,500]
[null,600,{"$f":"ROUND((((($C$5-$D$5)/(LN(($C$5-$E$5)/($D$5-$E$5))))/49.8328865456397)^vstupy!C113)*vstupy!C105*$I$5,0)","v":370},{"$f":"ROUND((((($C$5-$D$5)/(LN(($C$5-$E$5)/($D$5-$E$5))))/49.8328865456397)^vstupy!D113)*vstupy!D105*$I$5,0)","v":475},{"$f":"ROUND((((($C$5-$D$5)/(LN(($C$5-$E$5)/($D$5-$E$5))))/49.8328865456397)^vstupy!E113)*vstupy!E105*$I$5,0)","v":650},{"$f":"ROUND((((($C$5-$D$5)/(LN(($C$5-$E$5)/($D$5-$E$5))))/49.8328865456397)^vstupy!F113)*vstupy!F105*$I$5,0)","v":808},{"$f":"ROUND((((($C$5-$D$5)/(LN(($C$5-$E$5)/($D$5-$E$5))))/49.8328865456397)^vstupy!G113)*vstupy!G105*$I$5,0)","v":996},{"$f":"ROUND((((($C$5-$D$5)/(LN(($C$5-$E$5)/($D$5-$E$5))))/49.8328865456397)^vstupy!H113)*vstupy!H105*$I$5,0)","v":370},{"$f":"ROUND((((($C$5-$D$5)/(LN(($C$5-$E$5)/($D$5-$E$5))))/49.8328865456397)^vstupy!I113)*vstupy!I105*$I$5,0)","v":475},{"$f":"ROUND((((($C$5-$D$5)/(LN(($C$5-$E$5)/($D$5-$E$5))))/49.8328865456397)^vstupy!J113)*vstupy!J105*$I$5,0)","v":650},{"$f":"ROUND((((($C$5-$D$5)/(LN(($C$5-$E$5)/($D$5-$E$5))))/49.8328865456397)^vstupy!K113)*vstupy!K105*$I$5,0)","v":808},{"$f":"ROUND((((($C$5-$D$5)/(LN(($C$5-$E$5)/($D$5-$E$5))))/49.8328865456397)^vstupy!L113)*vstupy!L105*$I$5,0)","v":996},600,null,600,{"$f":"ROUND((((($C$5-$D$5)/(LN(($C$5-$E$5)/($D$5-$E$5))))/49.8328865456397)^vstupy!P113)*vstupy!P105*$I$5,0)","v":400},{"$f":"ROUND((((($C$5-$D$5)/(LN(($C$5-$E$5)/($D$5-$E$5))))/49.8328865456397)^vstupy!Q113)*vstupy!Q105*$I$5,0)","v":515},{"$f":"ROUND((((($C$5-$D$5)/(LN(($C$5-$E$5)/($D$5-$E$5))))/49.8328865456397)^vstupy!R113)*vstupy!R105*$I$5,0)","v":703},{"$f":"ROUND((((($C$5-$D$5)/(LN(($C$5-$E$5)/($D$5-$E$5))))/49.8328865456397)^vstupy!S113)*vstupy!S105*$I$5,0)","v":874},{"$f":"ROUND((((($C$5-$D$5)/(LN(($C$5-$E$5)/($D$5-$E$5))))/49.8328865456397)^vstupy!T113)*vstupy!T105*$I$5,0)","v":1078},null,null,null,null,null,600]
[null,750,{"$f":"ROUND((((($C$5-$D$5)/(LN(($C$5-$E$5)/($D$5-$E$5))))/49.8328865456397)^vstupy!C114)*vstupy!C106*$I$5,0)","v":450},{"$f":"ROUND((((($C$5-$D$5)/(LN(($C$5-$E$5)/($D$5-$E$5))))/49.8328865456397)^vstupy!D114)*vstupy!D106*$I$5,0)","v":579},{"$f":"ROUND((((($C$5-$D$5)/(LN(($C$5-$E$5)/($D$5-$E$5))))/49.8328865456397)^vstupy!E114)*vstupy!E106*$I$5,0)","v":791},{"$f":"ROUND((((($C$5-$D$5)/(LN(($C$5-$E$5)/($D$5-$E$5))))/49.8328865456397)^vstupy!F114)*vstupy!F106*$I$5,0)","v":984},{"$f":"ROUND((((($C$5-$D$5)/(LN(($C$5-$E$5)/($D$5-$E$5))))/49.8328865456397)^vstupy!G114)*vstupy!G106*$I$5,0)","v":1213},{"$f":"ROUND((((($C$5-$D$5)/(LN(($C$5-$E$5)/($D$5-$E$5))))/49.8328865456397)^vstupy!H114)*vstupy!H106*$I$5,0)","v":450},{"$f":"ROUND((((($C$5-$D$5)/(LN(($C$5-$E$5)/($D$5-$E$5))))/49.8328865456397)^vstupy!I114)*vstupy!I106*$I$5,0)","v":579},{"$f":"ROUND((((($C$5-$D$5)/(LN(($C$5-$E$5)/($D$5-$E$5))))/49.8328865456397)^vstupy!J114)*vstupy!J106*$I$5,0)","v":791},{"$f":"ROUND((((($C$5-$D$5)/(LN(($C$5-$E$5)/($D$5-$E$5))))/49.8328865456397)^vstupy!K114)*vstupy!K106*$I$5,0)","v":984},{"$f":"ROUND((((($C$5-$D$5)/(LN(($C$5-$E$5)/($D$5-$E$5))))/49.8328865456397)^vstupy!L114)*vstupy!L106*$I$5,0)","v":1213},750,null,750,{"$f":"ROUND((((($C$5-$D$5)/(LN(($C$5-$E$5)/($D$5-$E$5))))/49.8328865456397)^vstupy!P114)*vstupy!P106*$I$5,0)","v":485},{"$f":"ROUND((((($C$5-$D$5)/(LN(($C$5-$E$5)/($D$5-$E$5))))/49.8328865456397)^vstupy!Q114)*vstupy!Q106*$I$5,0)","v":624},{"$f":"ROUND((((($C$5-$D$5)/(LN(($C$5-$E$5)/($D$5-$E$5))))/49.8328865456397)^vstupy!R114)*vstupy!R106*$I$5,0)","v":852},{"$f":"ROUND((((($C$5-$D$5)/(LN(($C$5-$E$5)/($D$5-$E$5))))/49.8328865456397)^vstupy!S114)*vstupy!S106*$I$5,0)","v":1060},{"$f":"ROUND((((($C$5-$D$5)/(LN(($C$5-$E$5)/($D$5-$E$5))))/49.8328865456397)^vstupy!T114)*vstupy!T106*$I$5,0)","v":1307},null,null,null,null,null,750]
[]
[null,null,"KORALUX RONDO CLASSIC",null,null,null,null,"KORALUX RONDO CLASSIC - M",null,null,null,null,null,null,null,"KORALUX RONDO CLASSIC",null,null,null,null,"KORALUX RONDO CLASSIC - M"]
[null,"Délka L","Výška H [mm]",null,null,null,null,"Výška H [mm]",null,null,null,null,"Délka L",null,"Délka L","Výška H [mm]",null,null,null,null,"Výška H [mm]",null,null,null,null,"Délka L"]
[null,"[mm]",700,900,1220,1500,1820,700,900,1220,1500,1820,"[mm]",null,"[mm]",700,900,1220,1500,1820,700,900,1220,1500,1820,"[mm]"]
[null,450,{"$f":"ROUND((((($C$5-$D$5)/(LN(($C$5-$E$5)/($D$5-$E$5))))/49.8328865456397)^vstupy!C127)*vstupy!C119*$I$5,0)","v":255},{"$f":"ROUND((((($C$5-$D$5)/(LN(($C$5-$E$5)/($D$5-$E$5))))/49.8328865456397)^vstupy!D127)*vstupy!D119*$I$5,0)","v":333},{"$f":"ROUND((((($C$5-$D$5)/(LN(($C$5-$E$5)/($D$5-$E$5))))/49.8328865456397)^vstupy!E127)*vstupy!E119*$I$5,0)","v":462},{"$f":"ROUND((((($C$5-$D$5)/(LN(($C$5-$E$5)/($D$5-$E$5))))/49.8328865456397)^vstupy!F127)*vstupy!F119*$I$5,0)","v":581},{"$f":"ROUND((((($C$5-$D$5)/(LN(($C$5-$E$5)/($D$5-$E$5))))/49.8328865456397)^vstupy!G127)*vstupy!G119*$I$5,0)","v":725},{"$f":"ROUND((((($C$5-$D$5)/(LN(($C$5-$E$5)/($D$5-$E$5))))/49.8328865456397)^vstupy!H127)*vstupy!H119*$I$5,0)","v":255},{"$f":"ROUND((((($C$5-$D$5)/(LN(($C$5-$E$5)/($D$5-$E$5))))/49.8328865456397)^vstupy!I127)*vstupy!I119*$I$5,0)","v":333},{"$f":"ROUND((((($C$5-$D$5)/(LN(($C$5-$E$5)/($D$5-$E$5))))/49.8328865456397)^vstupy!J127)*vstupy!J119*$I$5,0)","v":462},{"$f":"ROUND((((($C$5-$D$5)/(LN(($C$5-$E$5)/($D$5-$E$5))))/49.8328865456397)^vstupy!K127)*vstupy!K119*$I$5,0)","v":581},{"$f":"ROUND((((($C$5-$D$5)/(LN(($C$5-$E$5)/($D$5-$E$5))))/49.8328865456397)^vstupy!L127)*vstupy!L119*$I$5,0)","v":725},450,null,450,{"$f":"ROUND((((($C$5-$D$5)/(LN(($C$5-$E$5)/($D$5-$E$5))))/49.8328865456397)^vstupy!P127)*vstupy!P119*$I$5,0)","v":291},{"$f":"ROUND((((($C$5-$D$5)/(LN(($C$5-$E$5)/($D$5-$E$5))))/49.8328865456397)^vstupy!Q127)*vstupy!Q119*$I$5,0)","v":378},{"$f":"ROUND((((($C$5-$D$5)/(LN(($C$5-$E$5)/($D$5-$E$5))))/49.8328865456397)^vstupy!R127)*vstupy!R119*$I$5,0)","v":519},{"$f":"ROUND((((($C$5-$D$5)/(LN(($C$5-$E$5)/($D$5-$E$5))))/49.8328865456397)^vstupy!S127)*vstupy!S119*$I$5,0)","v":643},{"$f":"ROUND((((($C$5-$D$5)/(LN(($C$5-$E$5)/($D$5-$E$5))))/49.8328865456397)^vstupy!T127)*vstupy!T119*$I$5,0)","v":786},null,null,null,null,null,450]
[null,500,{"$f":"ROUND((((($C$5-$D$5)/(LN(($C$5-$E$5)/($D$5-$E$5))))/49.8328865456397)^vstupy!C128)*vstupy!C120*$I$5,0)","v":280},{"$f":"ROUND((((($C$5-$D$5)/(LN(($C$5-$E$5)/($D$5-$E$5))))/49.8328865456397)^vstupy!D128)*vstupy!D120*$I$5,0)","v":365},{"$f":"ROUND((((($C$5-$D$5)/(LN(($C$5-$E$5)/($D$5-$E$5))))/49.8328865456397)^vstupy!E128)*vstupy!E120*$I$5,0)","v":507},{"$f":"ROUND((((($C$5-$D$5)/(LN(($C$5-$E$5)/($D$5-$E$5))))/49.8328865456397)^vstupy!F128)*vstupy!F120*$I$5,0)","v":638},{"$f":"ROUND((((($C$5-$D$5)/(LN(($C$5-$E$5)/($D$5-$E$5))))/49.8328865456397)^vstupy!G128)*vstupy!G120*$I$5,0)","v":795},{"$f":"ROUND((((($C$5-$D$5)/(LN(($C$5-$E$5)/($D$5-$E$5))))/49.8328865456397)^vstupy!H128)*vstupy!H120*$I$5,0)","v":280},{"$f":"ROUND((((($C$5-$D$5)/(LN(($C$5-$E$5)/($D$5-$E$5))))/49.8328865456397)^vstupy!I128)*vstupy!I120*$I$5,0)","v":365},{"$f":"ROUND((((($C$5-$D$5)/(LN(($C$5-$E$5)/($D$5-$E$5))))/49.8328865456397)^vstupy!J128)*vstupy!J120*$I$5,0)","v":507},{"$f":"ROUND((((($C$5-$D$5)/(LN(($C$5-$E$5)/($D$5-$E$5))))/49.8328865456397)^vstupy!K128)*vstupy!K120*$I$5,0)","v":638},{"$f":"ROUND((((($C$5-$D$5)/(LN(($C$5-$E$5)/($D$5-$E$5))))/49.8328865456397)^vstupy!L128)*vstupy!L120*$I$5,0)","v":795},500,null,500,{"$f":"ROUND((((($C$5-$D$5)/(LN(($C$5-$E$5)/($D$5-$E$5))))/49.8328865456397)^vstupy!P129)*vstupy!P120*$I$5,0)","v":318},{"$f":"ROUND((((($C$5-$D$5)/(LN(($C$5-$E$5)/($D$5-$E$5))))/49.8328865456397)^vstupy!Q129)*vstupy!Q120*$I$5,0)","v":413},{"$f":"ROUND((((($C$5-$D$5)/(LN(($C$5-$E$5)/($D$5-$E$5))))/49.8328865456397)^vstupy!R129)*vstupy!R120*$I$5,0)","v":567},{"$f":"ROUND((((($C$5-$D$5)/(LN(($C$5-$E$5)/($D$5-$E$5))))/49.8328865456397)^vstupy!S129)*vstupy!S120*$I$5,0)","v":703},{"$f":"ROUND((((($C$5-$D$5)/(LN(($C$5-$E$5)/($D$5-$E$5))))/49.8328865456397)^vstupy!T129)*vstupy!T120*$I$5,0)","v":859}]
[null,600,{"$f":"ROUND((((($C$5-$D$5)/(LN(($C$5-$E$5)/($D$5-$E$5))))/49.8328865456397)^vstupy!C129)*vstupy!C121*$I$5,0)","v":329},{"$f":"ROUND((((($C$5-$D$5)/(LN(($C$5-$E$5)/($D$5-$E$5))))/49.8328865456397)^vstupy!D129)*vstupy!D121*$I$5,0)","v":429},{"$f":"ROUND((((($C$5-$D$5)/(LN(($C$5-$E$5)/($D$5-$E$5))))/49.8328865456397)^vstupy!E129)*vstupy!E121*$I$5,0)","v":596},{"$f":"ROUND((((($C$5-$D$5)/(LN(($C$5-$E$5)/($D$5-$E$5))))/49.8328865456397)^vstupy!F129)*vstupy!F121*$I$5,0)","v":750},{"$f":"ROUND((((($C$5-$D$5)/(LN(($C$5-$E$5)/($D$5-$E$5))))/49.8328865456397)^vstupy!G129)*vstupy!G121*$I$5,0)","v":934},{"$f":"ROUND((((($C$5-$D$5)/(LN(($C$5-$E$5)/($D$5-$E$5))))/49.8328865456397)^vstupy!H129)*vstupy!H121*$I$5,0)","v":329},{"$f":"ROUND((((($C$5-$D$5)/(LN(($C$5-$E$5)/($D$5-$E$5))))/49.8328865456397)^vstupy!I129)*vstupy!I121*$I$5,0)","v":429},{"$f":"ROUND((((($C$5-$D$5)/(LN(($C$5-$E$5)/($D$5-$E$5))))/49.8328865456397)^vstupy!J129)*vstupy!J121*$I$5,0)","v":596},{"$f":"ROUND((((($C$5-$D$5)/(LN(($C$5-$E$5)/($D$5-$E$5))))/49.8328865456397)^vstupy!K129)*vstupy!K121*$I$5,0)","v":750},{"$f":"ROUND((((($C$5-$D$5)/(LN(($C$5-$E$5)/($D$5-$E$5))))/49.8328865456397)^vstupy!L129)*vstupy!L121*$I$5,0)","v":934},600,null,600,{"$f":"ROUND((((($C$5-$D$5)/(LN(($C$5-$E$5)/($D$5-$E$5))))/49.8328865456397)^vstupy!P130)*vstupy!P121*$I$5,0)","v":372},{"$f":"ROUND((((($C$5-$D$5)/(LN(($C$5-$E$5)/($D$5-$E$5))))/49.8328865456397)^vstupy!Q130)*vstupy!Q121*$I$5,0)","v":482},{"$f":"ROUND((((($C$5-$D$5)/(LN(($C$5-$E$5)/($D$5-$E$5))))/49.8328865456397)^vstupy!R130)*vstupy!R121*$I$5,0)","v":662},{"$f":"ROUND((((($C$5-$D$5)/(LN(($C$5-$E$5)/($D$5-$E$5))))/49.8328865456397)^vstupy!S130)*vstupy!S121*$I$5,0)","v":820},{"$f":"ROUND((((($C$5-$D$5)/(LN(($C$5-$E$5)/($D$5-$E$5))))/49.8328865456397)^vstupy!T130)*vstupy!T121*$I$5,0)","v":1003},null,null,null,null,null,600]
[null,750,{"$f":"ROUND((((($C$5-$D$5)/(LN(($C$5-$E$5)/($D$5-$E$5))))/49.8328865456397)^vstupy!C130)*vstupy!C122*$I$5,0)","v":400},{"$f":"ROUND((((($C$5-$D$5)/(LN(($C$5-$E$5)/($D$5-$E$5))))/49.8328865456397)^vstupy!D130)*vstupy!D122*$I$5,0)","v":522},{"$f":"ROUND((((($C$5-$D$5)/(LN(($C$5-$E$5)/($D$5-$E$5))))/49.8328865456397)^vstupy!E130)*vstupy!E122*$I$5,0)","v":726},{"$f":"ROUND((((($C$5-$D$5)/(LN(($C$5-$E$5)/($D$5-$E$5))))/49.8328865456397)^vstupy!F130)*vstupy!F122*$I$5,0)","v":913},{"$f":"ROUND((((($C$5-$D$5)/(LN(($C$5-$E$5)/($D$5-$E$5))))/49.8328865456397)^vstupy!G130)*vstupy!G122*$I$5,0)","v":1138},{"$f":"ROUND((((($C$5-$D$5)/(LN(($C$5-$E$5)/($D$5-$E$5))))/49.8328865456397)^vstupy!H130)*vstupy!H122*$I$5,0)","v":400},{"$f":"ROUND((((($C$5-$D$5)/(LN(($C$5-$E$5)/($D$5-$E$5))))/49.8328865456397)^vstupy!I130)*vstupy!I122*$I$5,0)","v":522},{"$f":"ROUND((((($C$5-$D$5)/(LN(($C$5-$E$5)/($D$5-$E$5))))/49.8328865456397)^vstupy!J130)*vstupy!J122*$I$5,0)","v":726},{"$f":"ROUND((((($C$5-$D$5)/(LN(($C$5-$E$5)/($D$5-$E$5))))/49.8328865456397)^vstupy!K130)*vstupy!K122*$I$5,0)","v":913},{"$f":"ROUND((((($C$5-$D$5)/(LN(($C$5-$E$5)/($D$5-$E$5))))/49.8328865456397)^vstupy!L130)*vstupy!L122*$I$5,0)","v":1138},750,null,750,{"$f":"ROUND((((($C$5-$D$5)/(LN(($C$5-$E$5)/($D$5-$E$5))))/49.8328865456397)^vstupy!P130)*vstupy!P122*$I$5,0)","v":449},{"$f":"ROUND((((($C$5-$D$5)/(LN(($C$5-$E$5)/($D$5-$E$5))))/49.8328865456397)^vstupy!Q130)*vstupy!Q122*$I$5,0)","v":583},{"$f":"ROUND((((($C$5-$D$5)/(LN(($C$5-$E$5)/($D$5-$E$5))))/49.8328865456397)^vstupy!R130)*vstupy!R122*$I$5,0)","v":799},{"$f":"ROUND((((($C$5-$D$5)/(LN(($C$5-$E$5)/($D$5-$E$5))))/49.8328865456397)^vstupy!S130)*vstupy!S122*$I$5,0)","v":991},{"$f":"ROUND((((($C$5-$D$5)/(LN(($C$5-$E$5)/($D$5-$E$5))))/49.8328865456397)^vstupy!T130)*vstupy!T122*$I$5,0)","v":1211},null,null,null,null,null,750]
[]
[null,null,"KORALUX RONDO EXCLUSIVE - M",null,null,null,null,null,null,null,null,null,null,null,null,"KORALUX RONDO EXCLUSIVE - M"]
[null,"Délka L","Výška H [mm]",null,null,null,null,null,null,null,null,null,null,null,"Délka L","Výška H [mm]"]
[null,"[mm]",900,1220,1500,1820,null,null,null,null,null,null,null,null,"[mm]",900,1220,1500,1820]
[null,450,{"$f":"ROUND((((($C$5-$D$5)/(LN(($C$5-$E$5)/($D$5-$E$5))))/49.8328865456397)^vstupy!C142)*vstupy!C135*$I$5,0)","v":249},{"$f":"ROUND((((($C$5-$D$5)/(LN(($C$5-$E$5)/($D$5-$E$5))))/49.8328865456397)^vstupy!D142)*vstupy!D135*$I$5,0)","v":338},{"$f":"ROUND((((($C$5-$D$5)/(LN(($C$5-$E$5)/($D$5-$E$5))))/49.8328865456397)^vstupy!E142)*vstupy!E135*$I$5,0)","v":419},{"$f":"ROUND((((($C$5-$D$5)/(LN(($C$5-$E$5)/($D$5-$E$5))))/49.8328865456397)^vstupy!F142)*vstupy!F135*$I$5,0)","v":516},null,null,null,null,null,null,null,null,450]
[null,600,{"$f":"ROUND((((($C$5-$D$5)/(LN(($C$5-$E$5)/($D$5-$E$5))))/49.8328865456397)^vstupy!C143)*vstupy!C136*$I$5,0)","v":319},{"$f":"ROUND((((($C$5-$D$5)/(LN(($C$5-$E$5)/($D$5-$E$5))))/49.8328865456397)^vstupy!D143)*vstupy!D136*$I$5,0)","v":433},{"$f":"ROUND((((($C$5-$D$5)/(LN(($C$5-$E$5)/($D$5-$E$5))))/49.8328865456397)^vstupy!E143)*vstupy!E136*$I$5,0)","v":537},{"$f":"ROUND((((($C$5-$D$5)/(LN(($C$5-$E$5)/($D$5-$E$5))))/49.8328865456397)^vstupy!F143)*vstupy!F136*$I$5,0)","v":662},null,null,null,null,null,null,null,null,600]
[null,750,{"$f":"ROUND((((($C$5-$D$5)/(LN(($C$5-$E$5)/($D$5-$E$5))))/49.8328865456397)^vstupy!C144)*vstupy!C137*$I$5,0)","v":387},{"$f":"ROUND((((($C$5-$D$5)/(LN(($C$5-$E$5)/($D$5-$E$5))))/49.8328865456397)^vstupy!D144)*vstupy!D137*$I$5,0)","v":526},{"$f":"ROUND((((($C$5-$D$5)/(LN(($C$5-$E$5)/($D$5-$E$5))))/49.8328865456397)^vstupy!E144)*vstupy!E137*$I$5,0)","v":652},{"$f":"ROUND((((($C$5-$D$5)/(LN(($C$5-$E$5)/($D$5-$E$5))))/49.8328865456397)^vstupy!F144)*vstupy!F137*$I$5,0)","v":802},null,null,null,null,null,null,null,null,750]

{"sheet":"vstupy","index":3,"n_rows":229,"n_cols":26,"rows_kept":229,"cut":false,"hidden":true,"merged":[]}
[]
[]
[]
[]
[]
[]
[]
[]
[]
[]
[null,null,"VÝKONY PRO ZAPOJENÍ ZDOLA DOLŮ",null,null,null,null,null,null,null,null,null,null,null,"VÝKONY PRO ÚHLOPŘÍČNÉ ZAPOJENÍ"]
[null,null,"KORALUX LINEAR MAX",null,null,null,null,"KORALUX LINEAR MAX - M",null,null,null,null,null,null,null,"KORALUX LINEAR MAX",null,null,null,null,"KORALUX LINEAR MAX - M"]
[null,"Délka L","Výška H [mm]",null,null,null,null,"Výška H [mm]",null,null,null,null,"Délka L",null,"Délka L","Výška H [mm]",null,null,null,null,"Výška H [mm]",null,null,null,null,"Délka L"]
[null,"[mm]",700,900,1220,1500,1820,700,900,1220,1500,1820,"[mm]",null,"[mm]",700,900,1220,1500,1820,700,900,1220,1500,1820,"[mm]"]
[null,450,320,411,557,686,833,320,411,557,686,833,450,null,450,341,436,592,735,906,null,null,null,null,null,450]
[null,600,422,543,736,906,1101,422,543,736,906,1101,600,null,600,454,580,789,979,1206,null,null,null,null,null,600]
[null,750,524,673,913,1124,1367,524,673,913,1124,1367,750,null,750,567,725,985,1222,1507,null,null,null,null,null,750]
[]
[null,null,"KORALUX LINEAR MAX",null,null,null,null,"KORALUX LINEAR MAX - M",null,null,null,null,null,null,null,"KORALUX LINEAR MAX",null,null,null,null,"KORALUX LINEAR MAX - M"]
[null,"Délka L","Výška H [mm]",null,null,null,null,"Výška H [mm]",null,null,null,null,"Délka L",null,"Délka L","Výška H [mm]",null,null,null,null,"Výška H [mm]",null,null,null,null,"Délka L"]
[null,"[mm]",700,900,1220,1500,1820,700,900,1220,1500,1820,"[mm]",null,"[mm]",700,900,1220,1500,1820,700,900,1220,1500,1820,"[mm]"]
[null,450,1.2363,1.2464999999999999,1.2626999999999999,1.2688999999999999,1.276,1.2363,1.2464999999999999,1.2626999999999999,1.2688999999999999,1.276,450,null,450,1.2765,1.2816000000000001,1.2896000000000001,1.2967,1.3048]
[null,600,1.2476,1.256,1.2695000000000001,1.2646999999999999,1.2592000000000001,1.2476,1.256,1.2695000000000001,1.2646999999999999,1.2592000000000001,600,null,600,1.2650999999999999,1.2694000000000001,1.2762,1.2821,1.2889999999999999]
[null,750,1.2587999999999999,1.2655000000000001,1.2762,1.2604,1.2423999999999999,1.2587999999999999,1.2655000000000001,1.2762,1.2604,1.2423999999999999,750,null,750,1.2537,1.2572000000000001,1.2626999999999999,1.2676000000000001,1.2730999999999999,null,null,null,null,null,750]
[]
[null,null,"KORALUX LINEAR COMFORT",null,null,null,null,"KORALUX LINEAR COMFORT - M",null,null,null,null,null,null,null,"KORALUX LINEAR COMFORT",null,null,null,null,"KORALUX LINEAR COMFORT - M"]
[null,"Délka L","Výška H [mm]",null,null,null,null,"Výška H [mm]",null,null,null,null,"Délka L",null,"Délka L","Výška H [mm]",null,null,null,null,"Výška H [mm]",null,null,null,null,"Délka L"]
[null,"[mm]",700,900,1220,1500,1820,700,900,1220,1500,1820,"[mm]",null,"[mm]",700,900,1220,1500,1820,700,900,1220,1500,1820,"[mm]"]
[null,450,287,369,504,626,772,287,369,504,626,772,450,null,450,312,402,549,682,841,null,null,null,null,null,450]
[null,500,315,405,553,687,848,315,405,553,687,848,500,null,500,342,440,601,747,921,null,null,null,null,null,500]
[null,600,370,475,650,808,996,370,475,650,808,996,600,null,600,400,515,703,874,1078,null,null,null,null,null,600]
[null,750,450,579,791,984,1213,450,579,791,984,1213,750,null,750,485,624,852,1060,1307,null,null,null,null,null,750]
[]
[null,null,"KORALUX LINEAR COMFORT",null,null,null,null,"KORALUX LINEAR COMFORT - M",null,null,null,null,null,null,null,"KORALUX LINEAR COMFORT",null,null,null,null,"KORALUX LINEAR COMFORT - M"]
[null,"Délka L","Výška H [mm]",null,null,null,null,"Výška H [mm]",null,null,null,null,"Délka L",null,"Délka L","Výška H [mm]",null,null,null,null,"Výška H [mm]",null,null,null,null,"Délka L"]
[null,"[mm]",700,900,1220,1500,1820,700,900,1220,1500,1820,"[mm]",null,"[mm]",700,900,1220,1500,1820,700,900,1220,1500,1820,"[mm]"]
[null,450,1.2452000000000001,1.2488999999999999,1.2548999999999999,1.2588999999999999,1.2634000000000001,1.2452000000000001,1.2488999999999999,1.2548999999999999,1.2588999999999999,1.2634000000000001,450,null,450,1.2638,1.2699,1.2797000000000001,1.2883,1.2981,null,null,null,null,null,450]
[null,500,1.2421,1.2463,1.2532000000000001,1.2573000000000001,1.2621,1.2421,1.2463,1.2532000000000001,1.2573000000000001,1.2621,500,null,500,1.2543,1.2621,1.2744,1.2853000000000001,1.2976000000000001,null,null,null,null,null,500]
[null,600,1.2358,1.2412000000000001,1.2499,1.2543,1.2594000000000001,1.2358,1.2412000000000001,1.2499,1.2543,1.2594000000000001,600,null,600,1.2354000000000001,1.2463,1.2638,1.2791999999999999,1.2967,null,null,null,null,null,600]
[null,750,1.2262999999999999,1.2334000000000001,1.2447999999999999,1.2497,1.2553000000000001,1.2262999999999999,1.2334000000000001,1.2447999999999999,1.2497,1.2553000000000001,750,null,750,1.2069000000000001,1.2226999999999999,1.2479,1.27,1.2952999999999999,null,null,null,null,null,750]
[]
[null,null,"KORALUX LINEAR CLASSIC",null,null,null,null,"KORALUX LINEAR CLASSIC - M",null,null,null,null,null,null,null,"KORALUX LINEAR CLASSIC",null,null,null,null,"KORALUX LINEAR CLASSIC - M"]
[null,"Délka L","Výška H [mm]",null,null,null,null,"Výška H [mm]",null,null,null,null,"Délka L",null,"Délka L","Výška H [mm]",null,null,null,null,"Výška H [mm]",null,null,null,null,"Délka L"]
[null,"[mm]",{"$f":"logic!$L$4","v":"Délka"},900,1220,1500,1820,700,900,1220,1500,1820,"[mm]",null,"[mm]",700,900,1220,1500,1820,700,900,1220,1500,1820,"[mm]"]
[null,450,{"$f":"IF(logic!$D$99=1,C166,C202)","v":255},{"$f":"IF(logic!$D$99=1,D166,D202)","v":333},{"$f":"IF(logic!$D$99=1,E166,E202)","v":462},{"$f":"IF(logic!$D$99=1,F166,F202)","v":581},{"$f":"IF(logic!$D$99=1,G166,G202)","v":725},{"$f":"IF(logic!$D$99=1,H166,H202)","v":255},{"$f":"IF(logic!$D$99=1,I166,I202)","v":333},{"$f":"IF(logic!$D$99=1,J166,J202)","v":462},{"$f":"IF(logic!$D$99=1,K166,K202)","v":581},{"$f":"IF(logic!$D$99=1,L166,L202)","v":725},450,null,450,291,378,519,643,786,null,null,null,null,null,450]
[null,500,{"$f":"IF(logic!$D$99=1,C167,C203)","v":280},{"$f":"IF(logic!$D$99=1,D167,D203)","v":365},{"$f":"IF(logic!$D$99=1,E167,E203)","v":507},{"$f":"IF(logic!$D$99=1,F167,F203)","v":638},{"$f":"IF(logic!$D$99=1,G167,G203)","v":795},{"$f":"IF(logic!$D$99=1,H167,H203)","v":280},{"$f":"IF(logic!$D$99=1,I167,I203)","v":365},{"$f":"IF(logic!$D$99=1,J167,J203)","v":507},{"$f":"IF(logic!$D$99=1,K167,K203)","v":638},{"$f":"IF(logic!$D$99=1,L167,L203)","v":795},500,null,500,318,413,567,703,859,null,null,null,null,null,500]
[null,600,{"$f":"IF(logic!$D$99=1,C168,C204)","v":329},{"$f":"IF(logic!$D$99=1,D168,D204)","v":429},{"$f":"IF(logic!$D$99=1,E168,E204)","v":596},{"$f":"IF(logic!$D$99=1,F168,F204)","v":750},{"$f":"IF(logic!$D$99=1,G168,G204)","v":934},{"$f":"IF(logic!$D$99=1,H168,H204)","v":329},{"$f":"IF(logic!$D$99=1,I168,I204)","v":429},{"$f":"IF(logic!$D$99=1,J168,J204)","v":596},{"$f":"IF(logic!$D$99=1,K168,K204)","v":750},{"$f":"IF(logic!$D$99=1,L168,L204)","v":934},600,null,600,372,482,662,820,1003,null,null,null,null,null,600]
[null,750,{"$f":"IF(logic!$D$99=1,C169,C205)","v":400},{"$f":"IF(logic!$D$99=1,D169,D205)","v":522},{"$f":"IF(logic!$D$99=1,E169,E205)","v":726},{"$f":"IF(logic!$D$99=1,F169,F205)","v":913},{"$f":"IF(logic!$D$99=1,G169,G205)","v":1138},{"$f":"IF(logic!$D$99=1,H169,H205)","v":400},{"$f":"IF(logic!$D$99=1,I169,I205)","v":522},{"$f":"IF(logic!$D$99=1,J169,J205)","v":726},{"$f":"IF(logic!$D$99=1,K169,K205)","v":913},{"$f":"IF(logic!$D$99=1,L169,L205)","v":1138},750,null,750,449,583,799,991,1211,null,null,null,null,null,750]
[]
[null,null,"KORALUX LINEAR CLASSIC",null,null,null,null,"KORALUX LINEAR CLASSIC - M",null,null,null,null,null,null,null,"KORALUX LINEAR CLASSIC",null,null,null,null,"KORALUX LINEAR CLASSIC - M"]
[null,"Délka L","Výška H [mm]",null,null,null,null,"Výška H [mm]",null,null,null,null,"Délka L",null,"Délka L","Výška H [mm]",null,null,null,null,"Výška H [mm]",null,null,null,null,"Délka L"]
[null,"[mm]",700,900,1220,1500,1820,700,900,1220,1500,1820,"[mm]",null,"[mm]",700,900,1220,1500,1820,700,900,1220,1500,1820,"[mm]"]
[null,450,{"$f":"IF(logic!$D$99=1,C174,C210)","v":1.2225999999999999},{"$f":"IF(logic!$D$99=1,D174,D210)","v":1.2358},{"$f":"IF(logic!$D$99=1,E174,E210)","v":1.2567999999999999},{"$f":"IF(logic!$D$99=1,F174,F210)","v":1.2521},{"$f":"IF(logic!$D$99=1,G174,G210)","v":1.2421},{"$f":"IF(logic!$D$99=1,H174,H210)","v":1.2225999999999999},{"$f":"IF(logic!$D$99=1,I174,I210)","v":1.2358},{"$f":"IF(logic!$D$99=1,J174,J210)","v":1.2567999999999999},{"$f":"IF(logic!$D$99=1,K174,K210)","v":1.2521},{"$f":"IF(logic!$D$99=1,L174,L210)","v":1.2421},450,null,450,1.2765,1.2783,1.2810999999999999,1.2836000000000001,1.2864,null,null,null,null,null,450]
[null,500,{"$f":"IF(logic!$D$99=1,C175,C211)","v":1.2225999999999999},{"$f":"IF(logic!$D$99=1,D175,D211)","v":1.2346999999999999},{"$f":"IF(logic!$D$99=1,E175,E211)","v":1.254},{"$f":"IF(logic!$D$99=1,F175,F211)","v":1.2483},{"$f":"IF(logic!$D$99=1,G175,G211)","v":1.2393000000000001},{"$f":"IF(logic!$D$99=1,H175,H211)","v":1.2225999999999999},{"$f":"IF(logic!$D$99=1,I175,I211)","v":1.2346999999999999},{"$f":"IF(logic!$D$99=1,J175,J211)","v":1.254},{"$f":"IF(logic!$D$99=1,K175,K211)","v":1.2483},{"$f":"IF(logic!$D$99=1,L175,L211)","v":1.2393000000000001},500,null,500,1.2655000000000001,1.2690999999999999,1.2748999999999999,1.28,1.2859,null,null,null,null,null,500]
[null,600,{"$f":"IF(logic!$D$99=1,C176,C212)","v":1.2224999999999999},{"$f":"IF(logic!$D$99=1,D176,D212)","v":1.2324999999999999},{"$f":"IF(logic!$D$99=1,E176,E212)","v":1.2484},{"$f":"IF(logic!$D$99=1,F176,F212)","v":1.2407999999999999},{"$f":"IF(logic!$D$99=1,G176,G212)","v":1.2337},{"$f":"IF(logic!$D$99=1,H176,H212)","v":1.2224999999999999},{"$f":"IF(logic!$D$99=1,I176,I212)","v":1.2324999999999999},{"$f":"IF(logic!$D$99=1,J176,J212)","v":1.2484},{"$f":"IF(logic!$D$99=1,K176,K212)","v":1.2407999999999999},{"$f":"IF(logic!$D$99=1,L176,L212)","v":1.2337},600,null,600,1.2435,1.2508999999999999,1.2626999999999999,1.2729999999999999,1.2847999999999999,null,null,null,null,null,600]
[null,750,{"$f":"IF(logic!$D$99=1,C177,C213)","v":1.2223999999999999},{"$f":"IF(logic!$D$99=1,D177,D213)","v":1.2292000000000001},{"$f":"IF(logic!$D$99=1,E177,E213)","v":1.24},{"$f":"IF(logic!$D$99=1,F177,F213)","v":1.2294},{"$f":"IF(logic!$D$99=1,G177,G213)","v":1.2252000000000001},{"$f":"IF(logic!$D$99=1,H177,H213)","v":1.2223999999999999},{"$f":"IF(logic!$D$99=1,I177,I213)","v":1.2292000000000001},{"$f":"IF(logic!$D$99=1,J177,J213)","v":1.24},{"$f":"IF(logic!$D$99=1,K177,K213)","v":1.2294},{"$f":"IF(logic!$D$99=1,L177,L213)","v":1.2252000000000001},750,null,750,1.2104999999999999,1.2235,1.2442,1.2624,1.2830999999999999,null,null,null,null,null,750]
[]
[null,null,"KORALUX STANDARD",null,null,null,null,null,null,null,null,null,null,null,null,"KORALUX STANDARD"]
[null,"Délka L","Výška H [mm]",null,null,null,null,null,null,null,null,null,null,null,"Délka L","Výška H [mm]"]
[null,"[mm]",700,900,1220,1500,null,null,null,null,null,null,null,null,"[mm]",700,900,1220,1500]
[null,400,198,254,345,427,null,null,null,null,null,null,null,null,400,213,275,373,458]
[null,500,231,297,403,499,null,null,null,null,null,null,null,null,500,249,322,436,536]
[null,600,263,337,458,567,null,null,null,null,null,null,null,null,600,283,365,496,609]
[]
[null,null,"KORALUX STANDARD",null,null,null,null,null,null,null,null,null,null,null,null,"KORALUX STANDARD"]
[null,"Délka L","Výška H [mm]",null,null,null,null,null,null,null,null,null,null,null,"Délka L","Výška H [mm]"]
[null,"[mm]",700,900,1220,1500,null,null,null,null,null,null,null,null,"[mm]",700,900,1220,1500]
[null,400,1.2346999999999999,1.2153,1.2274,1.2423,null,null,null,null,null,null,null,null,400,1.2674000000000001,1.2364999999999999,1.2274,1.264]
[null,500,1.2278,1.2219,1.2341,1.2456,null,null,null,null,null,null,null,null,500,1.2616000000000001,1.2432000000000001,1.2341,1.2567999999999999]
[null,600,1.2209000000000001,1.2284999999999999,1.2406999999999999,1.2488999999999999,null,null,null,null,null,null,null,null,600,1.2557,1.2499,1.2406999999999999,1.2532000000000001]
[]
[null,null,"KORALUX LINEAR EXCLUSIVE - M",null,null,null,null,null,null,null,null,null,null,null,null,"KORALUX LINEAR EXCLUSIVE - M"]
[null,"Délka L","Výška H [mm]",null,null,null,null,null,null,null,null,null,null,null,"Délka L","Výška H [mm]"]
[null,"[mm]",900,1220,1500,1820,null,null,null,null,null,null,null,null,"[mm]",900,1220,1500,1820]
[null,450,249,338,419,516,null,null,null,null,null,null,null,null,450]
[null,600,319,433,537,662,null,null,null,null,null,null,null,null,600]
[null,750,387,526,652,802,null,null,null,null,null,null,null,null,750]
[]
[null,null,"KORALUX LINEAR EXCLUSIVE - M",null,null,null,null,null,null,null,null,null,null,null,null,"KORALUX LINEAR EXCLUSIVE - M"]
[null,"Délka L","Výška H [mm]",null,null,null,null,null,null,null,null,null,null,null,"Délka L","Výška H [mm]"]
[null,"[mm]",900,1220,1500,1820,null,null,null,null,null,null,null,null,"[mm]",900,1220,1500,1820]
[null,450,1.2519,1.2768999999999999,1.266,1.2625,null,null,null,null,null,null,null,null,450]
[null,600,1.2522,1.2709999999999999,1.2606999999999999,1.2563,null,null,null,null,null,null,null,null,600]
[null,750,1.2525999999999999,1.2649999999999999,1.2553000000000001,1.25,null,null,null,null,null,null,null,null,750]
[]
[null,null,"KORALUX RONDO MAX",null,null,null,null,"KORALUX RONDO MAX - M",null,null,null,null,null,null,null,"KORALUX RONDO MAX",null,null,null,null,"KORALUX RONDO MAX - M"]
[null,"Délka L","Výška H [mm]",null,null,null,null,"Výška H [mm]",null,null,null,null,"Délka L",null,"Délka L","Výška H [mm]",null,null,null,null,"Výška H [mm]",null,null,null,null,"Délka L"]
[null,"[mm]",700,900,1220,1500,1820,700,900,1220,1500,1820,"[mm]",null,"[mm]",700,900,1220,1500,1820,700,900,1220,1500,1820,"[mm]"]
[null,450,335,432,589,725,879,335,432,589,725,879,450,null,450,361,462,625,771,942,null,null,null,null,null,450]
[null,600,444,574,781,962,1166,444,574,781,962,1166,600,null,600,480,614,832,1026,1253,null,null,null,null,null,600]
[null,750,553,714,973,1197,1452,553,714,973,1197,1452,750,null,750,599,767,1038,1280,1564,null,null,null,null,null,750]
[]
[null,null,"KORALUX RONDO MAX",null,null,null,null,"KORALUX RONDO MAX - M",null,null,null,null,null,null,null,"KORALUX RONDO MAX",null,null,null,null,"KORALUX RONDO MAX - M"]
[null,"Délka L","Výška H [mm]",null,null,null,null,"Výška H [mm]",null,null,null,null,"Délka L",null,"Délka L","Výška H [mm]",null,null,null,null,"Výška H [mm]",null,null,null,null,"Délka L"]
[null,"[mm]",700,900,1220,1500,1820,700,900,1220,1500,1820,"[mm]",null,"[mm]",700,900,1220,1500,1820,700,900,1220,1500,1820,"[mm]"]
[null,450,1.2322,1.2336,1.2357,1.2376,1.2398,1.2322,1.2336,1.2357,1.2376,1.2398,450,null,450,1.266,1.2674000000000001,1.2697000000000001,1.2717000000000001,1.274,null,null,null,null,null,450]
[null,600,1.2279,1.2343,1.2445999999999999,1.2383999999999999,1.2314000000000001,1.2279,1.2343,1.2445999999999999,1.2383999999999999,1.2314000000000001,600,null,600,1.2554000000000001,1.2567999999999999,1.2591000000000001,1.2611000000000001,1.2634000000000001,null,null,null,null,null,600]
[null,750,1.2235,1.2350000000000001,1.2534000000000001,1.2392000000000001,1.2229000000000001,1.2235,1.2350000000000001,1.2534000000000001,1.2392000000000001,1.2229000000000001,750,null,750,1.2447999999999999,1.2462,1.2484999999999999,1.2504999999999999,1.2527999999999999,null,null,null,null,null,750]
[]
[null,null,"KORALUX RONDO COMFORT",null,null,null,null,"KORALUX RONDO COMFORT - M",null,null,null,null,null,null,null,"KORALUX RONDO COMFORT",null,null,null,null,"KORALUX RONDO COMFORT - M"]
[null,"Délka L","Výška H [mm]",null,null,null,null,"Výška H [mm]",null,null,null,null,"Délka L",null,"Délka L","Výška H [mm]",null,null,null,null,"Výška H [mm]",null,null,null,null,"Délka L"]
[null,"[mm]",700,900,1220,1500,1820,700,900,1220,1500,1820,"[mm]",null,"[mm]",700,900,1220,1500,1820,700,900,1220,1500,1820,"[mm]"]
[null,450,287,369,504,626,772,287,369,504,626,772,450,null,450,312,402,549,682,841,null,null,null,null,null,450]
[null,500,315,405,553,687,848,315,405,553,687,848,500,null,500,342,440,601,747,921,null,null,null,null,null,500]
[null,600,370,475,650,808,996,370,475,650,808,996,600,null,600,400,515,703,874,1078,null,null,null,null,null,600]
[null,750,450,579,791,984,1213,450,579,791,984,1213,750,null,750,485,624,852,1060,1307,null,null,null,null,null,750]
[]
[null,null,"KORALUX RONDO COMFORT",null,null,null,null,"KORALUX RONDO COMFORT - M",null,null,null,null,null,null,null,"KORALUX RONDO COMFORT",null,null,null,null,"KORALUX RONDO COMFORT - M"]
[null,"Délka L","Výška H [mm]",null,null,null,null,"Výška H [mm]",null,null,null,null,"Délka L",null,"Délka L","Výška H [mm]",null,null,null,null,"Výška H [mm]",null,null,null,null,"Délka L"]
[null,"[mm]",700,900,1220,1500,1820,700,900,1220,1500,1820,"[mm]",null,"[mm]",700,900,1220,1500,1820,700,900,1220,1500,1820,"[mm]"]
[null,450,1.2452000000000001,1.2488999999999999,1.2548999999999999,1.2588999999999999,1.2634000000000001,1.2452000000000001,1.2488999999999999,1.2548999999999999,1.2588999999999999,1.2634000000000001,450,null,450,1.2638,1.2699,1.2797000000000001,1.2883,1.2981,null,null,null,null,null,450]
[null,500,1.2421,1.2463,1.2532000000000001,1.2573000000000001,1.2621,1.2421,1.2463,1.2532000000000001,1.2573000000000001,1.2621,500,null,500,1.2543,1.2621,1.2744,1.2853000000000001,1.2976000000000001,null,null,null,null,null,500]
[null,600,1.2358,1.2412000000000001,1.2499,1.2543,1.2594000000000001,1.2358,1.2412000000000001,1.2499,1.2543,1.2594000000000001,600,null,600,1.2354000000000001,1.2463,1.2638,1.2791999999999999,1.2967,null,null,null,null,null,600]
[null,750,1.2262999999999999,1.2334000000000001,1.2447999999999999,1.2497,1.2553000000000001,1.2262999999999999,1.2334000000000001,1.2447999999999999,1.2497,1.2553000000000001,750,null,750,1.2069000000000001,1.2226999999999999,1.2479,1.27,1.2952999999999999,null,null,null,null,null,750]
[]
[null,null,"KORALUX RONDO CLASSIC",null,null,null,null,"KORALUX RONDO CLASSIC - M",null,null,null,null,null,null,null,"KORALUX RONDO CLASSIC",null,null,null,null,"KORALUX RONDO CLASSIC - M"]
[null,"Délka L","Výška H [mm]",null,null,null,null,"Výška H [mm]",null,null,null,null,"Délka L",null,"Délka L","Výška H [mm]",null,null,null,null,"Výška H [mm]",null,null,null,null,"Délka L"]
[null,"[mm]",700,900,1220,1500,1820,700,900,1220,1500,1820,"[mm]",null,"[mm]",700,900,1220,1500,1820,700,900,1220,1500,1820,"[mm]"]
[null,450,{"$f":"IF(logic!$D$99=1,C182,C218)","v":255},{"$f":"IF(logic!$D$99=1,D182,D218)","v":333},{"$f":"IF(logic!$D$99=1,E182,E218)","v":462},{"$f":"IF(logic!$D$99=1,F182,F218)","v":581},{"$f":"IF(logic!$D$99=1,G182,G218)","v":725},{"$f":"IF(logic!$D$99=1,H182,H218)","v":255},{"$f":"IF(logic!$D$99=1,I182,I218)","v":333},{"$f":"IF(logic!$D$99=1,J182,J218)","v":462},{"$f":"IF(logic!$D$99=1,K182,K218)","v":581},{"$f":"IF(logic!$D$99=1,L182,L218)","v":725},450,null,450,291,378,519,643,786,null,null,null,null,null,450]
[null,500,{"$f":"IF(logic!$D$99=1,C183,C219)","v":280},{"$f":"IF(logic!$D$99=1,D183,D219)","v":365},{"$f":"IF(logic!$D$99=1,E183,E219)","v":507},{"$f":"IF(logic!$D$99=1,F183,F219)","v":638},{"$f":"IF(logic!$D$99=1,G183,G219)","v":795},{"$f":"IF(logic!$D$99=1,H183,H219)","v":280},{"$f":"IF(logic!$D$99=1,I183,I219)","v":365},{"$f":"IF(logic!$D$99=1,J183,J219)","v":507},{"$f":"IF(logic!$D$99=1,K183,K219)","v":638},{"$f":"IF(logic!$D$99=1,L183,L219)","v":795},500,null,500,318,413,567,703,859,null,null,null,null,null,500]
[null,600,{"$f":"IF(logic!$D$99=1,C184,C220)","v":329},{"$f":"IF(logic!$D$99=1,D184,D220)","v":429},{"$f":"IF(logic!$D$99=1,E184,E220)","v":596},{"$f":"IF(logic!$D$99=1,F184,F220)","v":750},{"$f":"IF(logic!$D$99=1,G184,G220)","v":934},{"$f":"IF(logic!$D$99=1,H184,H220)","v":329},{"$f":"IF(logic!$D$99=1,I184,I220)","v":429},{"$f":"IF(logic!$D$99=1,J184,J220)","v":596},{"$f":"IF(logic!$D$99=1,K184,K220)","v":750},{"$f":"IF(logic!$D$99=1,L184,L220)","v":934},600,null,600,372,482,662,820,1003,null,null,null,null,null,600]
[null,750,{"$f":"IF(logic!$D$99=1,C185,C221)","v":400},{"$f":"IF(logic!$D$99=1,D185,D221)","v":522},{"$f":"IF(logic!$D$99=1,E185,E221)","v":726},{"$f":"IF(logic!$D$99=1,F185,F221)","v":913},{"$f":"IF(logic!$D$99=1,G185,G221)","v":1138},{"$f":"IF(logic!$D$99=1,H185,H221)","v":400},{"$f":"IF(logic!$D$99=1,I185,I221)","v":522},{"$f":"IF(logic!$D$99=1,J185,J221)","v":726},{"$f":"IF(logic!$D$99=1,K185,K221)","v":913},{"$f":"IF(logic!$D$99=1,L185,L221)","v":1138},750,null,750,449,583,799,991,1211,null,null,null,null,null,750]
[]
[null,null,"KORALUX RONDO CLASSIC",null,null,null,null,"KORALUX RONDO CLASSIC - M",null,null,null,null,null,null,null,"KORALUX RONDO CLASSIC",null,null,null,null,"KORALUX RONDO CLASSIC - M"]
[null,"Délka L","Výška H [mm]",null,null,null,null,"Výška H [mm]",null,null,null,null,"Délka L",null,"Délka L","Výška H [mm]",null,null,null,null,"Výška H [mm]",null,null,null,null,"Délka L"]
[null,"[mm]",700,900,1220,1500,1820,700,900,1220,1500,1820,"[mm]",null,"[mm]",700,900,1220,1500,1820,700,900,1220,1500,1820,"[mm]"]
[null,450,{"$f":"IF(logic!$D$99=1,C190,C226)","v":1.2225999999999999},{"$f":"IF(logic!$D$99=1,D190,D226)","v":1.2358},{"$f":"IF(logic!$D$99=1,E190,E226)","v":1.2567999999999999},{"$f":"IF(logic!$D$99=1,F190,F226)","v":1.2521},{"$f":"IF(logic!$D$99=1,G190,G226)","v":1.2421},{"$f":"IF(logic!$D$99=1,H190,H226)","v":1.2225999999999999},{"$f":"IF(logic!$D$99=1,I190,I226)","v":1.2358},{"$f":"IF(logic!$D$99=1,J190,J226)","v":1.2567999999999999},{"$f":"IF(logic!$D$99=1,K190,K226)","v":1.2521},{"$f":"IF(logic!$D$99=1,L190,L226)","v":1.2421},450,null,450,1.2765,1.2783,1.2810999999999999,1.2836000000000001,1.2864,null,null,null,null,null,450]
[null,500,{"$f":"IF(logic!$D$99=1,C191,C227)","v":1.2225999999999999},{"$f":"IF(logic!$D$99=1,D191,D227)","v":1.2346999999999999},{"$f":"IF(logic!$D$99=1,E191,E227)","v":1.254},{"$f":"IF(logic!$D$99=1,F191,F227)","v":1.2483},{"$f":"IF(logic!$D$99=1,G191,G227)","v":1.2393000000000001},{"$f":"IF(logic!$D$99=1,H191,H227)","v":1.2225999999999999},{"$f":"IF(logic!$D$99=1,I191,I227)","v":1.2346999999999999},{"$f":"IF(logic!$D$99=1,J191,J227)","v":1.254},{"$f":"IF(logic!$D$99=1,K191,K227)","v":1.2483},{"$f":"IF(logic!$D$99=1,L191,L227)","v":1.2393000000000001},500,null,500,1.2655000000000001,1.2690999999999999,1.2748999999999999,1.28,1.2859,null,null,null,null,null,500]
[null,600,{"$f":"IF(logic!$D$99=1,C192,C228)","v":1.2224999999999999},{"$f":"IF(logic!$D$99=1,D192,D228)","v":1.2324999999999999},{"$f":"IF(logic!$D$99=1,E192,E228)","v":1.2484},{"$f":"IF(logic!$D$99=1,F192,F228)","v":1.2407999999999999},{"$f":"IF(logic!$D$99=1,G192,G228)","v":1.2337},{"$f":"IF(logic!$D$99=1,H192,H228)","v":1.2224999999999999},{"$f":"IF(logic!$D$99=1,I192,I228)","v":1.2324999999999999},{"$f":"IF(logic!$D$99=1,J192,J228)","v":1.2484},{"$f":"IF(logic!$D$99=1,K192,K228)","v":1.2407999999999999},{"$f":"IF(logic!$D$99=1,L192,L228)","v":1.2337},600,null,600,1.2435,1.2508999999999999,1.2626999999999999,1.2729999999999999,1.2847999999999999,null,null,null,null,null,600]
[null,750,{"$f":"IF(logic!$D$99=1,C193,C229)","v":1.2223999999999999},{"$f":"IF(logic!$D$99=1,D193,D229)","v":1.2292000000000001},{"$f":"IF(logic!$D$99=1,E193,E229)","v":1.24},{"$f":"IF(logic!$D$99=1,F193,F229)","v":1.2294},{"$f":"IF(logic!$D$99=1,G193,G229)","v":1.2252000000000001},{"$f":"IF(logic!$D$99=1,H193,H229)","v":1.2223999999999999},{"$f":"IF(logic!$D$99=1,I193,I229)","v":1.2292000000000001},{"$f":"IF(logic!$D$99=1,J193,J229)","v":1.24},{"$f":"IF(logic!$D$99=1,K193,K229)","v":1.2294},{"$f":"IF(logic!$D$99=1,L193,L229)","v":1.2252000000000001},750,null,750,1.2104999999999999,1.2235,1.2442,1.2624,1.2830999999999999,null,null,null,null,null,750]
[]
[null,null,"KORALUX RONDO EXCLUSIVE - M",null,null,null,null,null,null,null,null,null,null,null,null,"KORALUX RONDO EXCLUSIVE - M"]
[null,"Délka L","Výška H [mm]",null,null,null,null,null,null,null,null,null,null,null,"Délka L","Výška H [mm]"]
[null,"[mm]",900,1220,1500,1820,null,null,null,null,null,null,null,null,"[mm]",900,1220,1500,1820]
[null,450,249,338,419,516,null,null,null,null,null,null,null,null,450]
[null,600,319,433,537,662,null,null,null,null,null,null,null,null,600]
[null,750,387,526,652,802,null,null,null,null,null,null,null,null,750]
[]
[null,null,"KORALUX RONDO EXCLUSIVE - M",null,null,null,null,null,null,null,null,null,null,null,null,"KORALUX RONDO EXCLUSIVE - M"]
[null,"Délka L","Výška H [mm]",null,null,null,null,null,null,null,null,null,null,null,"Délka L","Výška H [mm]"]
[null,"[mm]",900,1220,1500,1820,null,null,null,null,null,null,null,null,"[mm]",900,1220,1500,1820]
[null,450,1.2519,1.2768999999999999,1.266,1.2625,null,null,null,null,null,null,null,null,450]
[null,600,1.2522,1.2709999999999999,1.2606999999999999,1.2563,null,null,null,null,null,null,null,null,600]
[null,750,1.2525999999999999,1.2649999999999999,1.2553000000000001,1.25,null,null,null,null,null,null,null,null,750]
[]
[]
[]
[]
[]
[]
[]
[]
[]
[]
[]
[]
[]
[]
[]
[]
["české"]
[]
[null,null,"KORALUX LINEAR CLASSIC",null,null,null,null,"KORALUX LINEAR CLASSIC - M"]
[null,"Délka L","Výška H [mm]",null,null,null,null,"Výška H [mm]",null,null,null,null,"Délka L"]
[null,"[mm]","Délka",900,1220,1500,1820,700,900,1220,1500,1820,"[mm]"]
[null,450,267,348,479,597,735,267,348,479,597,735,450]
[null,500,292,380,523,652,803,292,380,523,652,803,500]
[null,600,341,443,611,761,937,341,443,611,761,937,600]
[null,750,412,535,737,919,1131,412,535,737,919,1131,750]
[]
[null,null,"KORALUX LINEAR CLASSIC",null,null,null,null,"KORALUX LINEAR CLASSIC - M"]
[null,"Délka L","Výška H [mm]",null,null,null,null,"Výška H [mm]",null,null,null,null,"Délka L"]
[null,"[mm]",700,900,1220,1500,1820,700,900,1220,1500,1820,"[mm]"]
[null,450,1.2309000000000001,1.2392000000000001,1.2524,1.2514000000000001,1.2503,1.2309000000000001,1.2392000000000001,1.2524,1.2514000000000001,1.2503,450]
[null,500,1.2293000000000001,1.2374000000000001,1.2504999999999999,1.2501,1.2496,1.2293000000000001,1.2374000000000001,1.2504999999999999,1.2501,1.2496,500]
[null,600,1.226,1.234,1.2467999999999999,1.2474000000000001,1.2481,1.226,1.234,1.2467999999999999,1.2474000000000001,1.2481,600]
[null,750,1.2211000000000001,1.2287999999999999,1.2412000000000001,1.2433000000000001,1.2458,1.2211000000000001,1.2287999999999999,1.2412000000000001,1.2433000000000001,1.2458,750]
[]
[null,null,"KORALUX RONDO CLASSIC",null,null,null,null,"KORALUX RONDO CLASSIC - M"]
[null,"Délka L","Výška H [mm]",null,null,null,null,"Výška H [mm]",null,null,null,null,"Délka L"]
[null,"[mm]",700,900,1220,1500,1820,700,900,1220,1500,1820,"[mm]"]
[null,450,267,348,479,597,735,267,348,479,597,735,450]
[null,500,292,380,523,652,803,292,380,523,652,803,500]
[null,600,341,443,611,761,937,341,443,611,761,937,600]
[null,750,412,535,737,919,1131,412,535,737,919,1131,750]
[]
[null,null,"KORALUX RONDO CLASSIC",null,null,null,null,"KORALUX RONDO CLASSIC - M"]
[null,"Délka L","Výška H [mm]",null,null,null,null,"Výška H [mm]",null,null,null,null,"Délka L"]
[null,"[mm]",700,900,1220,1500,1820,700,900,1220,1500,1820,"[mm]"]
[null,450,1.2309000000000001,1.2392000000000001,1.2524,1.2514000000000001,1.2503,1.2309000000000001,1.2392000000000001,1.2524,1.2514000000000001,1.2503,450]
[null,500,1.2293000000000001,1.2374000000000001,1.2504999999999999,1.2501,1.2496,1.2293000000000001,1.2374000000000001,1.2504999999999999,1.2501,1.2496,500]
[null,600,1.226,1.234,1.2467999999999999,1.2474000000000001,1.2481,1.226,1.234,1.2467999999999999,1.2474000000000001,1.2481,600]
[null,750,1.2211000000000001,1.2287999999999999,1.2412000000000001,1.2433000000000001,1.2458,1.2211000000000001,1.2287999999999999,1.2412000000000001,1.2433000000000001,1.2458,750]
[]
[]
[]
["NF"]
[]
[null,null,"KORALUX LINEAR CLASSIC",null,null,null,null,"KORALUX LINEAR CLASSIC - M"]
[null,"Délka L","Výška H [mm]",null,null,null,null,"Výška H [mm]",null,null,null,null,"Délka L"]
[null,"[mm]",700,900,1220,1500,1820,700,900,1220,1500,1820,"[mm]"]
[null,450,255,333,462,581,725,255,333,462,581,725,450]
[null,500,280,365,507,638,795,280,365,507,638,795,500]
[null,600,329,429,596,750,934,329,429,596,750,934,600]
[null,750,400,522,726,913,1138,400,522,726,913,1138,750]
[]
[null,null,"KORALUX LINEAR CLASSIC",null,null,null,null,"KORALUX LINEAR CLASSIC - M"]
[null,"Délka L","Výška H [mm]",null,null,null,null,"Výška H [mm]",null,null,null,null,"Délka L"]
[null,"[mm]",700,900,1220,1500,1820,700,900,1220,1500,1820,"[mm]"]
[null,450,1.2225999999999999,1.2358,1.2567999999999999,1.2521,1.2421,1.2225999999999999,1.2358,1.2567999999999999,1.2521,1.2421,450]
[null,500,1.2225999999999999,1.2346999999999999,1.254,1.2483,1.2393000000000001,1.2225999999999999,1.2346999999999999,1.254,1.2483,1.2393000000000001,500]
[null,600,1.2224999999999999,1.2324999999999999,1.2484,1.2407999999999999,1.2337,1.2224999999999999,1.2324999999999999,1.2484,1.2407999999999999,1.2337,600]
[null,750,1.2223999999999999,1.2292000000000001,1.24,1.2294,1.2252000000000001,1.2223999999999999,1.2292000000000001,1.24,1.2294,1.2252000000000001,750]
[]
[null,null,"KORALUX RONDO CLASSIC",null,null,null,null,"KORALUX RONDO CLASSIC - M"]
[null,"Délka L","Výška H [mm]",null,null,null,null,"Výška H [mm]",null,null,null,null,"Délka L"]
[null,"[mm]",700,900,1220,1500,1820,700,900,1220,1500,1820,"[mm]"]
[null,450,255,333,462,581,725,255,333,462,581,725,450]
[null,500,280,365,507,638,795,280,365,507,638,795,500]
[null,600,329,429,596,750,934,329,429,596,750,934,600]
[null,750,400,522,726,913,1138,400,522,726,913,1138,750]
[]
[null,null,"KORALUX RONDO CLASSIC",null,null,null,null,"KORALUX RONDO CLASSIC - M"]
[null,"Délka L","Výška H [mm]",null,null,null,null,"Výška H [mm]",null,null,null,null,"Délka L"]
[null,"[mm]",700,900,1220,1500,1820,700,900,1220,1500,1820,"[mm]"]
[null,450,1.2225999999999999,1.2358,1.2567999999999999,1.2521,1.2421,1.2225999999999999,1.2358,1.2567999999999999,1.2521,1.2421,450]
[null,500,1.2225999999999999,1.2346999999999999,1.254,1.2483,1.2393000000000001,1.2225999999999999,1.2346999999999999,1.254,1.2483,1.2393000000000001,500]
[null,600,1.2224999999999999,1.2324999999999999,1.2484,1.2407999999999999,1.2337,1.2224999999999999,1.2324999999999999,1.2484,1.2407999999999999,1.2337,600]
[null,750,1.2223999999999999,1.2292000000000001,1.24,1.2294,1.2252000000000001,1.2223999999999999,1.2292000000000001,1.24,1.2294,1.2252000000000001,750]

{"sheet":"logic","index":4,"n_rows":107,"n_cols":34,"rows_kept":107,"cut":false,"hidden":true,"merged":[[57,0,57,4],[58,1,58,2]]}
["heslojeheslo"," "]
[null,null,null,null,null,null,"Popisky - úvodní strana",null,null,null,null,null,null,null,null,null,null,null,null,null,"lblZpusobPripojeniPopis"]
["Délka od",null,null,null,null,null,1,{"$f":"G3+1","v":2},{"$f":"H3+1","v":3},4,5,6,7,8,9,10,11,12,13,14,15,16,{"$f":"V3+1","v":17},{"$f":"W3+1","v":18},19,{"$f":"Y3+1","v":20},{"$f":"Z3+1","v":21},{"$f":"AA3+1","v":22},{"$f":"AB3+1","v":23},{"$f":"AC3+1","v":24},{"$f":"AD3+1","v":25}]
[1,{"$f":"VLOOKUP(A4,A5:B11,2,FALSE)","v":"vše"},null,null,null,null,1,{"$f":"VLOOKUP($G4,$G5:H19,H3,FALSE)","v":"Česky"},{"$f":"VLOOKUP($G4,$G5:I19,I3)","v":"vše"},{"$f":"VLOOKUP($G4,$G5:J19,J3)","v":"Tepelné výkony podle EN 442"},{"$f":"VLOOKUP($G4,$G5:K19,K3)","v":"Výška"},{"$f":"VLOOKUP($G4,$G5:L19,L3)","v":"Délka"},{"$f":"VLOOKUP($G4,$G5:M19,M3)","v":"od"},{"$f":"VLOOKUP($G4,$G5:N19,N3)","v":"do"},{"$f":"VLOOKUP($G4,$G5:O19,O3)","v":"Tepelný výkon"},{"$f":"VLOOKUP($G4,$G5:P19,P3)","v":"Teplota:"},{"$f":"VLOOKUP($G4,$G5:Q19,Q3)","v":"Chybný teplotní spád !!!"},{"$f":"VLOOKUP($G4,$G5:R19,R3)","v":"Detailní výběr"},{"$f":"VLOOKUP($G4,$G5:S19,S3)","v":"Zadání hodnot"},{"$f":"VLOOKUP($G4,$G5:T19,T3)","v":"Chybně zadané hodnoty !!!"},{"$f":"VLOOKUP($G4,$G5:U19,U3)","v":"Způsob připojení"},{"$f":"VLOOKUP($G4,$G5:V19,V3)","v":"Technické změny vyhrazeny."},{"$f":"VLOOKUP($G4,$G5:W19,W3)","v":"Uvedené výkony jsou platné pouze pro zemi:"},{"$f":"VLOOKUP($G4,$G5:X19,X3)","v":"Česká republika."},{"$f":"VLOOKUP($G4,$G5:Y19,Y3)","v":"Jednotka výkonu:"},{"$f":"VLOOKUP($G4,$G5:Z19,Z3)","v":"spodní zdola dolů"},{"$f":"VLOOKUP($G4,$G5:AA19,AA3)","v":"úhlopříčné shora"},{"$f":"VLOOKUP($G4,$G5:AB19,AB3)","v":"Provedení"},{"$f":"VLOOKUP($G4,$G5:AC19,AC3)","v":"Povrchová úprava"},{"$f":"VLOOKUP($G4,$G5:AD19,AD3)","v":"BARVA"},{"$f":"VLOOKUP($G4,$G5:AE19,AE3)","v":"CHROM"}]
[1,{"$f":"$I$4","v":"vše"},null,null,null,null,1,"Česky","vše","Tepelné výkony podle EN 442","Výška","Délka","od","do","Tepelný výkon","Teplota:","Chybný teplotní spád !!!","Detailní výběr","Zadání hodnot","Chybně zadané hodnoty !!!","Způsob připojení","Technické změny vyhrazeny.","Uvedené výkony jsou platné pouze pro zemi:","Česká republika.","Jednotka výkonu:","spodní zdola dolů","úhlopříčné shora","Provedení","Povrchová úprava","BARVA","CHROM"]
[2,400,null,null,null,null,2,"Anglicky","all","Heat outputs according to EN 442","Height","Length","from","up to","Heat output","Temperature:","Wrong temperature gradient !!!","Detailed selection","Select conditions","Wrong values input !!!","Type of connection","Technical changes reserved.","The quoted outputs are valid only for the country:","Chile.","Heat units:","bottom connection","double-sided from the top down","Version","Surface finish","COLOUR","CHROME"]
[3,450,null,null,null,null,3,"Německy","alles","Wärmeleistungen nach EN 442","Bauhöhe","Baulänge","von","bis","Wärmeleistungen","Temperatur:","Falscher Temperaturgradient","Detailauswahl","Auswahlkriterien","Falsche Dateneingabe !!!","Anschlussart an das Heizsystem","Technische Änderungen vorbehalten.","Die angegebenen Leistungen sind gültig nur für das Land:","Deutschland.",null,"unten zweiseitig","beidseitig von oben nach unten","Ausführung","Oberflächenbehandlung","FARBE","CHROM"]
[4,500,null,null,null,null,4,"Rusky","всё","Тепловые мощности согл. EN 442","Высота","Длина","от","до","Тепловая мощность","Температура","Неправильный перепад температуры","Тип радиатора","Параметры","Неправильно заданые значения!!!","Способ подключения","Призводитель оставляет за собой право на изменения.","Данные действительны только для","России.",null,"нижнее снизу вниз","двустороннее сверху вниз","Исполнение      ","Oтделка поверности","ЦВЕТ","ХРОМ"]
[5,600,null,null,null,null,5,"Polsky","wszystko","Wydajność cieplna wedlug EN 442","Wysokość","Długość","od","do","Wydajność cieplna ","Temperatura:","Błędny spadek cieplny !!!","Wybór detaliczny","Zadanie wartości","Błędne zadanie wartości !!!","Sposób podłączenia","Zmiany techniczne zastrzeżone.","Wprowadzene moce są platne tylko dla kraje:","Polska.",null,"dolne z dołu w dół","dwustronne z góry na dół","Wykonanie","Wykończenie powierzchni"]
[6,750,null,null,null,null,6,"Francouzsky","tout","Puissances thermiques selon EN 442","Hauteur","Longueur","de","à","Puissance thermique","Température:","Fausse cadence de température","Choix en détail","Introduction des valeurs","Valeurs mal introduites","Mode de raccordement","Tous droits de modification technique réservés.","Puissance dénommées sont valables pour le pays :","France.","Unité de puissance :","inférieur, du bes vers le bas","bilatéral de haut","Réalisation","Traitement de la surface","COULEUR","CHROME"]
[7,null,null,null,null,null,7,"Maďarsky","mind","Hőteljesítmény az EN 442 szerint","Magasság","Hossz"," ","-tól","Hőteljesítmény","Hőmérséklet:","Hibás hőmérséklet csökkenés !!!","Részletes kiválasztás","Értékek megadása","Hibásan megadott értékek !!!",null,"Műszaki adatok megváltoztatásának joga fenntartva.","A feltüntetett teljesítmények csak a következő országra érvényesek:","HU",null,null,null,"Termékcsaládok","Felületkezelés"]
[null,null,null,null,null,null,8,"Švédsky","alla","Värmeavgivning enligt EN 442","Höjd","Längd","från","till","Värmeavgivning ","Temperatur:","Fel temperaturfall !!!","Detaljerat urval","välj temperaturfall","Fel värde inskrivet !!!","Typ av anslutning","Med reservation för tekniska förändringar.","Nämnda effekter är giltiga endast i landet:","Sverige.","Värme enhet","Anslutning botten ","Dubbelsidig från topp och ner","Version","Ytfinish","Färg","Krom"]
["Délka do",null,null,null,null,null,9,"Rumunsky","toate","Puteri termice conform EN442","Înălţime","Lungime","de la","până la","Putere termică","Temperatură:","Gradient de temperatură greşit !!!","Căutare avansată","Selectaţi condiţiile","Parametrii greşiţi de intrare",null,"Producătorul îşi rezervă dreptul de a efectua modificări tehnice","Puterile termice menţionate sunt valabile pentru:","România.",null,null,null,"Versiune","Finisajul suprafeţei"]
[1,{"$f":"VLOOKUP(A14,A15:B21,2,FALSE)","v":"vše"},null,null,null,null,10,"Bulharsky","всички","Топлинни мощности според ЕН 442","Височина","Дължина","от","до","Топлинна мощност ","Температура:","Грешно температурно спадане !!!","Детайлен избор","Въвеждане на стойности","Грешно въведени стойности !!!","Начин на свързване","Право на технически промени.","Посочените мощности са валидни само за държава:","България.","Мярна единица за мощност:","долно отдолу долу","двустранно отгоре долу","Изпълнение","Повърхностно покритие","ЦВЯТ","ХРОМ"]
[1,{"$f":"$I$4","v":"vše"},null,null,null,null,11,"Holandsky","alles","Warmteafgiftes volgens EN 442","Hoogte","Lengte","van","tot","Warmteafgifte","Temperatuur:","Verkeerde temperatuur verhouding !!!","Gedetailleerde selectie","Ingeven van waarden","Waarden foutief ingegeven !!!","Type aansluiting","Het recht blijft behouden op technische wijzigingen.","De weergegeven vermogens zijn geldig in volgende landen:","België / Nederland","Eenheid van vermogen:","onderaansluiting","dubbelzijdig van bovenaan","Versie","Afwerkingslaag","KLEUR","CHROOM"]
[2,400,null,null,null,null,12,"Norsky","alle","Effekt avgivelse iht EN442","Høyde","Lengde","fra","til","Effekt avgivelse","Temperatur :","Feil temperatur fall !!!","Detaljert valg","velg temperaturfall","Feil verdi innskrevet !!!","Type anslutning","Med reservasjon for tekniske endringer.","Nevnte effekter er gyldig bare i Norge.","Norge.","Varme enhet","Anslutning fra bunnen","Dobbelsidig fra topp og ned","versjon",null,"Farge","Krom"]
[3,450,null,null,null,null,13]
[4,500,null,null,null,null,14]
[5,600,null,null,null,null,15]
[6,750]
[7]
[null,null,null,null,null,null,"Popisky - databáze",null,"lblPridatdoDB",null,"cmdOK",null,"lblZobrazitDatabazi","lblZpet","lblExportDatabaze"]
["Výška od",null,null,null,null,null,{"$f":"G3","v":1},{"$f":"G23+1","v":2},{"$f":"H23+1","v":3},4,5,6,7,8,9,10,11,12,13,14,15,16,{"$f":"V23+1","v":17},{"$f":"W23+1","v":18},{"$f":"X23+1","v":19},{"$f":"Y23+1","v":20},{"$f":"Z23+1","v":21},{"$f":"AA23+1","v":22},{"$f":"AB23+1","v":23},{"$f":"AC23+1","v":24},{"$f":"AD23+1","v":25},{"$f":"AE23+1","v":26},{"$f":"AF23+1","v":27},{"$f":"AG23+1","v":28}]
[1,{"$f":"VLOOKUP(A24,A25:B31,2,FALSE)","v":"vše"},null,null,null,null,{"$f":"$G$4","v":1},{"$f":"VLOOKUP($G24,$G25:H39,H23)","v":"Česky"},{"$f":"VLOOKUP($G24,$G25:I39,I23)","v":"Přidat do databáze"},{"$f":"VLOOKUP($G24,$G25:J39,J23)","v":"Mám opravdu smazat databázi?"},{"$f":"VLOOKUP($G24,$G25:K39,K23)","v":"OK"},{"$f":"VLOOKUP($G24,$G25:L39,L23)","v":"Počet záznamů v databázi:"},{"$f":"VLOOKUP($G24,$G25:M39,M23)","v":"Zobrazit databázi"},{"$f":"VLOOKUP($G24,$G25:N39,N23)","v":"Zpět na výběr"},{"$f":"VLOOKUP($G24,$G25:O39,O23)","v":"Export databáze"},{"$f":"VLOOKUP($G24,$G25:P39,P23)","v":"Cena (Kč)"},{"$f":"VLOOKUP($G24,$G25:Q39,Q23)","v":"Číslo"},{"$f":"VLOOKUP($G24,$G25:R39,R23)","v":"Model"},{"$f":"VLOOKUP($G24,$G25:S39,S23)","v":"Objednací číslo"},{"$f":"VLOOKUP($G24,$G25:T39,T23)","v":"Typ"},{"$f":"VLOOKUP($G24,$G25:U39,U23)","v":"Výška [mm]"},{"$f":"VLOOKUP($G24,$G25:V39,V23)","v":"Délka [mm]"},{"$f":"VLOOKUP($G24,$G25:W39,W23)","v":"t1"},{"$f":"VLOOKUP($G24,$G25:X39,X23)","v":"t2"},{"$f":"VLOOKUP($G24,$G25:Y39,Y23)","v":"ti"},{"$f":"VLOOKUP($G24,$G25:Z39,Z23)","v":"Tepelný výkon"},{"$f":"VLOOKUP($G24,$G25:AA39,AA23)","v":"Poznámka"},{"$f":"VLOOKUP($G24,$G25:AB39,AB23)","v":"Identifikace:"},{"$f":"VLOOKUP($G24,$G25:AC39,AC23)","v":"Vybraná oblast neobsahuje správná data!!!"},{"$f":"VLOOKUP($G24,$G25:AD39,AD23)","v":"OK"},{"$f":"VLOOKUP($G24,$G25:AE39,AE23)","v":0},{"$f":"VLOOKUP($G24,$G25:AF39,AF23)","v":0},{"$f":"VLOOKUP($G24,$G25:AG39,AG23)","v":0},{"$f":"VLOOKUP($G24,$G25:AH39,AH23)","v":0}]
[1,{"$f":"$I$4","v":"vše"},null,null,null,null,1,"Česky","Přidat do databáze","Mám opravdu smazat databázi?","OK","Počet záznamů v databázi:","Zobrazit databázi","Zpět na výběr","Export databáze","Cena (Kč)","Číslo","Model","Objednací číslo","Typ","Výška [mm]","Délka [mm]","t1","t2","ti","Tepelný výkon","Poznámka","Identifikace:","Vybraná oblast neobsahuje správná data!!!","OK"]
[2,700,null,null,null,null,2,"Anglicky","Add into database","Shall the database really be deleted?","OK","No. of articles in database:","Display the database","Back to menu","Database export","Price (€)","No.","Model","Order No.","TYPE","Height [mm]","Length [mm]","t1","t2","ti","Heat output","Note","Identification:","Selected area does not content right data !!!","OK"]
[3,900,null,null,null,null,3,"Německy","In die Database hinzufügen","Soll die Database wirklich gelöscht werden?","OK","Anzahl der Aufnahmen in der Database:","Database abbilden","Zurück zur Auswahl","Database exportieren","Preis (€)","No.","Modell","Bestellnummer","TYP","Bauhöhe [mm]","Baulänge [mm]","t1","t2","ti","Wärmeleistung","Bemerkung","Identifikation:","Ausgewählter Bereich beinhaltet nicht die richtigen Daten !!!","OK"]
[4,1220,null,null,null,null,4,"Rusky","Добавить в базу данных","Хотите сбросить базу данных??","OK","Количество записей в базе данный:","Изобразить колонки из перечня","Вернуться на выбор","Перевод избранных типов","Цена (€)","Ном.","Модель","Код изделия","Тип","Высота (мм)","Длина (мм)","Т1","Т2","ti","Тепловая мощность","Примечание","Идентификация:","В выбранной области имеется неправильная информация!!!","OK"]
[5,1500,null,null,null,null,5,"Polsky","Dołożyć do wykazu","Mam faktycznie stuszować wykaz??","OK","Liczba zapisów w wykazie:","Wyobrazić wykaz","Z powrotem na wybór","Eksport wykazu","Cena (PLN)","Num","Model","Numer zamówienia","Typ","Wysokość [mm]","Długość [mm]","t1","t2","ti","Wydajność cieplna","Notatka","Identyfikacja:","Wybrany zakres nie zawiera prawiedlowe dane!!!","OK"]
[6,1820,null,null,null,null,6,"Francouzsky","Ajouter dans la base de données","Etes-vous sur d´annulation de la base de données?","OK","No. d´inscriptions dans la base de données:","Montrer la base de données","Retour au choix","Export de la base de données",null,"No.","Modèle","No. De commande","TYPE","Hauteur [mm]","Longueur [mm]","t1","t2","ti","Puissance thermique","Nota","Identification:","La zone marquée ne contient pas de données correctes!!!","OK"]
[7,null,null,null,null,null,7,"Maďarsky","Adatbázisba küldés","Valóban törölni az adatbázist?","OK","Azt adatbázis tételeinek száma:","Adatbázis megjelenítése","Vissza a kiválasztáshoz","Adatbázis exportja",null,"Sz.","Modell","Megrend. szám","Típus","Magasság [mm]","Hosszúság [mm]","t1","t2","ti","Hőteljesít-       mény","Megjegyzés","Azonosító:","A kiválasztott terület nem tartalmaz valós adatokat !!!","OK"]
[null,null,null,null,null,null,8,"Švédsky","Lägg till i databasen","Ska du verkligen tömma databasen?","OK","Antal artiklar i databasen:","Visa databasen","Tillbaka till meny","Exportera värde",null,"Nr.","Model","Order Nr.","TYP","Höjd (mm)","Längd (mm)","t1","t2","ti","Värmeavgivning","Notering  ","Identifikation:","Vald ruta inehåller inte rätt data !!!","OK"]
["Výška do",null,null,null,null,null,9,"Rumunsky","Adăugare la baza de date","Sigur doriţi să ştergeţi baza de date?","OK","Nr. articolelor din baza de date","Afişare bază de date","Înapoi la meniu","Exportare bază de date",null,"Nr.","Model.","Comanda nr.","Tip","Înălţime [mm]","Lungime [mm]","t1","t2","ti ","Putere termică","Notă","Identificare:","Câmpul selectat nu conţine date corecte !!","OK"]
[1,{"$f":"VLOOKUP(A34,A35:B41,2,FALSE)","v":"vše"},null,null,null,null,10,"Bulharsky","Допълни в базата данни","Наистина ли да изтрия базата данни?","OK","Брой записвания в база данни:","Покажи база данни","Обратно към избор","Експорт на база данни",null,"Номер","Модел","Номер за поръчка","Тип","Височина [mm]","Дължина [mm]","t1","t2","ti","Топлинна мощност","Забележка","Идентификация:","Избраната област не съдържа правилни данни!!!","OK"]
[1,{"$f":"$I$4","v":"vše"},null,null,null,null,11,"Holandsky","Toevoegen in database","Bent u zeker om de database te verwijderen ?","OK","Aantal artikelen in de database:","Toon de database","Terug naar menu","Exporteer database",null,"Nr.","Model","Bestelnummer","Type","Hoogte [mm]","Lengte [mm]","t1","t2","ti","Warmteafgifte","Opmerking","Identificatie:","De selectie heeft geen correcte data !!!","OK"]
[2,700,null,null,null,null,12,"Norsky","Legg til i databasen","Ønsker virkelig du å tømme databasen ?","OK","Antal artikler i databasen","Vis databasen","Tilbake til menyen","Eksporterte verdier",null,"Nr.","Modell","Ordre nr. ","Type","Høyde (mm)","Lengde (mm)","t1","t2","ti","Effekt avgivelse","Tekst","Identifikasjon :","Valgt celle inneholder feil data  !!!","OK"]
[3,900,null,null,null,null,13]
[4,1220,null,null,null,null,14]
[5,1500,null,null,null,null,15]
[6,1820]
[7]
[null,null,{"$f":"logic!$L$4","v":"Délka"},null,null,null,"Přidávací a mazací formulář"]
[null,null,null,null,null,null,null,null,"lblNadpis",null,"lblTypPopis","lblVýškaPopis","lblDélka Popis","lblVýkonPopis","lblKodArtikluPopis","lblPoznamka","cmdZrusit","cmdVlozit","cmdNelze","lblZapisProveden","cmdVymazat",null,"lblVymaz","lblVymazDatabaze"]
[null,null,null,null,null,null,{"$f":"G23","v":1},{"$f":"G44+1","v":2},{"$f":"H44+1","v":3},{"$f":"I44+1","v":4},{"$f":"J44+1","v":5},{"$f":"K44+1","v":6},{"$f":"L44+1","v":7},{"$f":"M44+1","v":8},{"$f":"N44+1","v":9},{"$f":"O44+1","v":10},{"$f":"P44+1","v":11},{"$f":"Q44+1","v":12},{"$f":"R44+1","v":13},{"$f":"S44+1","v":14},{"$f":"T44+1","v":15},{"$f":"U44+1","v":16},{"$f":"V44+1","v":17},{"$f":"W44+1","v":18},{"$f":"X44+1","v":19},{"$f":"Y44+1","v":20},{"$f":"Z44+1","v":21},{"$f":"AA44+1","v":22}]
[1,{"$f":"VLOOKUP(A45,A46:B47,2,FALSE)","v":"W"},{"$f":"VLOOKUP(A45,A46:C47,3,FALSE)","v":"W"},{"$f":"VLOOKUP(A45,A46:D47,4,FALSE)","v":1},{"$f":"VLOOKUP(B45,B46:E47,4,FALSE)","v":"[W]"},null,{"$f":"$G$4","v":1},{"$f":"VLOOKUP($G45,$G46:H60,H44)","v":"Česky"},{"$f":"VLOOKUP($G45,$G46:I60,I44)","v":"Přidání položky do databáze"},{"$f":"VLOOKUP($G45,$G46:J60,J44)","v":"Model"},{"$f":"VLOOKUP($G45,$G46:K60,K44)","v":"Typ"},{"$f":"VLOOKUP($G45,$G46:L60,L44)","v":"Výška [mm]"},{"$f":"VLOOKUP($G45,$G46:M60,M44)","v":"Délka [mm]"},{"$f":"VLOOKUP($G45,$G46:N60,N44)","v":"Tepelný výkon"},{"$f":"VLOOKUP($G45,$G46:O60,O44)","v":"Objednací číslo"},{"$f":"VLOOKUP($G45,$G46:P60,P44)","v":"Poznámka (maximum 20 znaků):"},{"$f":"VLOOKUP($G45,$G46:Q60,Q44)","v":"Zrušit"},{"$f":"VLOOKUP($G45,$G46:R60,R44)","v":"Vložit"},{"$f":"VLOOKUP($G45,$G46:S60,S44)","v":"Formulář nelze zavřít tímto způsobem !!!"},{"$f":"VLOOKUP($G45,$G46:T60,T44)","v":"Zápis úspěšně proveden"},{"$f":"VLOOKUP($G45,$G46:U60,U44)","v":"Vymazat"},{"$f":"VLOOKUP($G45,$G46:V60,V44)","v":"Databáze"},{"$f":"VLOOKUP($G45,$G46:W60,W44)","v":"Výmaz položky z databáze"},{"$f":"VLOOKUP($G45,$G46:X60,X44)","v":"Výmaz databáze"},{"$f":"VLOOKUP($G45,$G46:Y60,Y44)","v":0},{"$f":"VLOOKUP($G45,$G46:Z60,Z44)","v":0},{"$f":"VLOOKUP($G45,$G46:AA60,AA44)","v":0},{"$f":"VLOOKUP($G45,$G46:AB60,AB44)","v":0}]
[1,"W","W",1,"[W]",null,1,"Česky","Přidání položky do databáze","Model","Typ","Výška [mm]","Délka [mm]",{"$f":"O5","v":"Tepelný výkon"},"Objednací číslo","Poznámka (maximum 20 znaků):","Zrušit","Vložit","Formulář nelze zavřít tímto způsobem !!!","Zápis úspěšně proveden","Vymazat","Databáze","Výmaz položky z databáze","Výmaz databáze"]
[2,"BTU","BTU",3.4119999999999999,"[BTU]",null,2,"Anglicky","Add item into the database","Model","Type","Height [mm]","Length [mm]",{"$f":"O6","v":"Heat output"},"Order No.","Note (up to 20 characters)","Cancel","Add","The form cannot be closed in this way !!!","Entry successfully processed ","Delete","Database","Delete an item from the database","Database erase"]
[null,null,null,null,null,null,3,"Německy","Den Posten in die Database hinzufügen","Modell","Typ","Bauhöhe [mm]","Baulänge [mm]","Wärmeleistungen","Bestellnummer","Bemerkung (max. 20 Zeichen)","Aufheben","Einfügen","Das Formular kann nicht auf diese Art geschlossen werden !!!","Eingabe erfolgreich durchgeführt","Löschen","Database","Den Posten aus der Database löschen","Database löschen"]
[null,null,null,null,null,null,4,"Rusky"," Добавить в базу данных","Модель","Тип","Высота (мм)","Длина (мм)","Тепловая мощность","Код изделия","Примечание (макс 20 знаков)","Отменить","Добавить","Документ не возможно закрыть в таком формате!!!","Запись успешно сделана","Смазать","База данных","Исключение позиции из базы данных","Сброс базы данных"]
[null,null,null,null,null,null,5,"Polsky","Dorzucanie pozycje do wykazu","Model","Typ","Wysokość [mm]","Długość [mm]","Wydajność cieplna ","Numer zamówienia","Notatka (maksymalnie 20 znaków)","Anulować","Włożyć","Formularz nie można w ten sposób zamknąć!!!","Zapis dokonan z powodzeniem","Wykreślać","Wykaz","Wykreślać pozycje z wykazu","Wykreślić z wykazu"]
[1,{"$f":"VLOOKUP(A51,A52:B53,2,FALSE)","v":"spodní zdola dolů"},null,null,null,null,6,"Francouzsky","Adjonction d´un article dans la base de données","Modèle","Type","Hauteur [mm]","Longueur [mm]","Puissance thermique","Indication de l´article","Note (20 caractères au maximum)","Annuler","Insérer","Il n´est pas possible de fermer le formulaire de cette façon !!!","Inscription réalisée avec succès","Effacer","Base de données","Effacement d´un article","Effacer la base de données"]
[1,{"$f":"Z4","v":"spodní zdola dolů"},null,null,null,null,7,"Maďarsky","Tétel hozzáadása az adatbázishoz","Modell","Típus","Magasság [mm]","Hosszúság [mm]","Hőteljesítmény","Megrendelési szám","Megjegyzés (maximum 20 karakter):","Mégse","Beszúr","Így nem lehet bezárni a programot !!!","A beírás sikeres volt","Töröl","Adatbázis","Tétel törlése az adatbázisból","Adatbázis törlése"]
[2,{"$f":"AA4","v":"úhlopříčné shora"},null,null,null,null,8,"Švédsky","Lägg objekt i databasen","Model","Typ","Höjd (mm)","Längd (mm)","Värmeavgivning ","Order Nr.","Notering (upp till 20 tecken)","Ångra","Lägg till","fel !!!","Invärde korrekta","Ta bort","Databas","Ta bort ett objekt från databas","Radera data"]
[null,null,null,null,null,null,9,"Rumunsky","Adăugare articol în baza de date","Model","Tip","Înălţime [mm]","Lungime [mm]","Putere termică","Comanda nr.","Observaţii (până la 20 de caractere)","Anulare","Adăugare ","Fereastra nu poate fi închisă în acest  mod !!!","Valorile de intrare au fost procesate cu succes","Şterge","Bază de date","Ştergerea unui articol din baza de date","Ştergere baza de date"]
[null,null,null,null,null,null,10,"Bulharsky","Допълване на позиции в базата данни","Модел","Тип","Височина [mm]","Дължина [mm]","Топлинна мощност ","Номер за поръчка","Забележка (максимално 20 знака):","Анулирай","Въведи","Формулярът не може да се затвори по този начин !!!","Успешно извършено записване","Изтрий","База данни","Изтрий позиции в база данни","Изтрий база данни"]
[null,null,null,null,null,null,11,"Holandsky","Toevoegen van artikel in database","Model","Type","Hoogte [mm]","Lengte [mm]","Warmteafgifte","Bestelnummer","Opmerking (maximum 20 karakters)","Annuleren","Toevoegen","Afsluiten van het document niet mogelijk !!!","Ingave succesvol beëindigd","Verwijder","Database","Verwijder een artikel uit de database","Verwijder de database"]
[null,null,null,null,null,null,12,"Norsky","Legg produktet i databasen","Modell","Type","Høyde (mm)","Lengde (mm)","Effekt avgivelse","Ordre nr. ","Tekst (maks 20 tegn)","Angre","Legg til","Feil !!!","Inndata er korrekt","Ta bort","Database","Ta bort en enhet fra databasen","Slett inndata"]
["Číslování verzí",null,null,null,null,null,13]
["kód země","číslo verze",null,"datum sort.","makra",null,14]
["CZ","1","02","01/2017","M",null,15]
[]
["AT",1,"01",null,"M"]
["CZ",2,"02"]
["DE",3,"03"]
["PL",4,"04"]
["UA",5,"05"]
["RU",null,"06",null,{"$f":"A60&\" OTT \"&B60&\".\"&C60&\"-\"&MID(D60,1,2)&\"/\"&MID(D60,6,2)&\" \"&E60","v":"CZ OTT 1.02-01/17 M"}]
["HU",null,"07"]
["SW",null,"08"]
["RO",null,"09"]
["CL",null,"10"]
[]
[]
[]
["KLMM",{"$f":"VLOOKUP(model_zdroj,A76:B90,2,FALSE)","v":"KORALUX LINEAR MAX - M"},null,null,null,"KORALUX LINEAR CLASSIC",null,null,{"$f":"VLOOKUP(F75,F76:I90,4,FALSE)","v":"KLC"}]
["KSC","KORALUX STANDARD",null,null,null,"KORALUX STANDARD",null,null,{"$f":"A76","v":"KSC"}]
["KLC","KORALUX LINEAR CLASSIC",null,null,null,"KORALUX LINEAR CLASSIC",null,null,"KLC"]
["KLCM","KORALUX LINEAR CLASSIC - M",null,null,null,"KORALUX LINEAR CLASSIC - M",null,null,"KLCM"]
["KRC","KORALUX RONDO CLASSIC",null,null,null,"KORALUX RONDO CLASSIC",null,null,"KRC"]
["KRCM","KORALUX RONDO CLASSIC - M",null,null,null,"KORALUX RONDO CLASSIC - M",null,null,"KRCM"]
["KLT","KORALUX LINEAR COMFORT",null,null,null,"KORALUX LINEAR COMFORT",null,null,"KLT"]
["KLTM","KORALUX LINEAR COMFORT - M",null,null,null,"KORALUX LINEAR COMFORT - M",null,null,"KLTM"]
["KRT","KORALUX RONDO COMFORT",null,null,null,"KORALUX RONDO COMFORT",null,null,"KRT"]
["KRTM","KORALUX RONDO COMFORT - M",null,null,null,"KORALUX RONDO COMFORT - M",null,null,"KRTM"]
["KLM","KORALUX LINEAR MAX",null,null,null,"KORALUX LINEAR MAX",null,null,"KLM"]
["KLMM","KORALUX LINEAR MAX - M",null,null,null,"KORALUX LINEAR MAX - M",null,null,"KLMM"]
["KRM","KORALUX RONDO MAX",null,null,null,"KORALUX RONDO MAX",null,null,"KRM"]
["KRMM","KORALUX RONDO MAX - M",null,null,null,"KORALUX RONDO MAX - M",null,null,"KRMM"]
["KLXM","KORALUX LINEAR EXCLUSIVE - M",null,null,null,"KORALUX LINEAR EXCLUSIVE - M",null,null,"KLXM"]
["KRXM","KORALUX RONDO EXCLUSIVE - M",null,null,null,"KORALUX RONDO EXCLUSIVE - M",null,null,"KRXM"]
[]
[]
[]
[]
[]
[]
[]
[null,null,null,"VÝKONY"]
[1,{"$f":"VLOOKUP(A99,A100:B101,2,FALSE)","v":"LINEAR"},null,2,{"$f":"VLOOKUP(D99,D100:E101,2,FALSE)","v":"NF"}]
[1,"LINEAR",null,1,"České"]
[2,"RONDO",null,2,"NF"]
[]
[]
[]
[1,{"$f":"VLOOKUP(A105,A106:B107,2,FALSE)","v":"BARVA"}]
[1,{"$f":"AD4","v":"BARVA"}]
[2,{"$f":"AE4","v":"CHROM"}]