{"text_format":"1","workbook":"xlsx","n_sheets":5,"sheets":["KORADO","Databáze","výkony","vstupy","logic"],"not_rendered":{"charts":0,"images":21,"macros":1,"external_links":0,"defined_names":50,"comments":0,"pivot_tables":0},"unopened":[],"bounds":{"document_bytes":16777216,"sheet_cells":100000,"rows_first":2000,"rows_last":500,"rows_between":2000,"halvings":0,"cell_chars":16384,"cell_head_chars":4096},"cells_cut":0,"cells_raw":0,"read":"whole","date_system":"1900"}

{"sheet":"KORADO","index":0,"n_rows":78,"n_cols":30,"rows_kept":78,"cut":false,"hidden":false,"merged":[[7,15,8,15],[7,16,8,16]]}
[]
[null,null,{"$f":"logic!P4","v":"Temperatura:"},{"$f":"logic!$N$64","v":"Celsius"},null,null,null,{"$f":"logic!R4","v":"Wybór detaliczny"}]
[null,null,"t 1","t 2","t i"," D T",null,null,null,{"$f":"logic!O4&\" \"&logic!M4","v":"Wydajność cieplna  od"},null,{"$f":"logic!C45& \" \"&logic!N4","v":"W do"},null,{"$f":"logic!C45","v":"W"}]
[null,null,75,65,20,{"$f":"(C4+D4)/2-E4","v":50},null,null,null,{"$f":"logic!K4&\" \"&logic!M4","v":"Wysokość od"},{"$f":"logic!B24","v":"wszystko"},{"$f":"logic!$O$64&\" \"&logic!$N$4","v":"mm do"},{"$f":"logic!B34","v":"wszystko"},{"$f":"logic!$O$64","v":"mm"}]
[null,null,{"$f":"logic!J4","v":"Wydajność cieplna wedlug EN 442"},null,null,null,null,null,null,{"$f":"logic!L4&\" \"&logic!M4","v":"Długość od"},{"$f":"logic!B4","v":"wszystko"},{"$f":"logic!$O$64&\" \"&logic!$N$4","v":"mm do"},{"$f":"logic!B14","v":"wszystko"},{"$f":"logic!$O$64","v":"mm"}]
[null,null,{"$f":"IF(OR(C4<7,D4<6,C4>110,D4>110,C4<=D4,F4<=0,E4<4,E4>40.5),logic!Q4,0)","v":0}]
[null,null,{"$f":"logic!$AB$4","v":"Wykonanie"},null,{"$f":"logic!$AC$4","v":"Wykończenie powierzchni"},null,null,{"$f":"logic!U4","v":"Sposób podłączenia"}]
[null,null,{"$f":"logic!B98","v":"LINEAR"},null,{"$f":"logic!B104","v":"FARBA"},null,null,{"$f":"lblZpusobPripojeni","v":"dolne z dołu w dół"},null,null,null,null,null,null,null,{"$f":"logic!L24","v":"Liczba zapisów w wykazie:"},{"$f":"MAX(Databáze!A:A)","v":0}]
[]
[]
[]
[null,null,null,{"$f":"IF(AND($K$4=logic!$I$4,$M$4=logic!$I$4),1,IF(D15=$K$4,1,0))","v":1},{"$f":"IF(AND($K$4=logic!$I$4,$M$4=logic!$I$4),1,IF(AND(E15>=$K$4,E15<=$M$4),1,0))","v":1},{"$f":"IF(AND($K$4=logic!$I$4,$M$4=logic!$I$4),1,IF(AND(F15>=$K$4,F15<=$M$4),1,0))","v":1},{"$f":"IF(AND($K$4=logic!$I$4,$M$4=logic!$I$4),1,IF(AND(G15>=$K$4,G15<=$M$4),1,0))","v":1},{"$f":"IF(AND($K$4=logic!$I$4,$M$4=logic!$I$4),1,IF(AND(H15>=$K$4,H15<=$M$4),1,0))","v":1},{"$f":"IF(logic!$A$50=2,0,IF(AND($K$4=logic!$I$4,$M$4=logic!$I$4),1,IF(I15=$K$4,1,0)))","v":1},{"$f":"IF(logic!$A$50=2,0,IF(AND($K$4=logic!$I$4,$M$4=logic!$I$4),1,IF(AND(E15>=$K$4,E15<=$M$4),1,0)))","v":1},{"$f":"IF(logic!$A$50=2,0,IF(AND($K$4=logic!$I$4,$M$4=logic!$I$4),1,IF(AND(F15>=$K$4,F15<=$M$4),1,0)))","v":1},{"$f":"IF(logic!$A$50=2,0,IF(AND($K$4=logic!$I$4,$M$4=logic!$I$4),1,IF(AND(G15>=$K$4,G15<=$M$4),1,0)))","v":1},{"$f":"IF(logic!$A$50=2,0,IF(AND($K$4=logic!$I$4,$M$4=logic!$I$4),1,IF(AND(H15>=$K$4,H15<=$M$4),1,0)))","v":1}]
[null,null,null,"KORALUX LINEAR MAX",null,null,null,null,"KORALUX LINEAR MAX - M",null,null,null,null,null,null,null,null,null,null,"KORALUX LINEAR MAX",null,null,null,null,"KORALUX LINEAR MAX - M"]
[null,null,{"$f":"logic!$L$4","v":"Długość"},{"$f":"logic!$K$4&\" H [\"&logic!$O$64&\"]\"","v":"Wysokość H [mm]"},null,null,null,null,{"$f":"logic!$K$4&\" H [\"&logic!$O$64&\"]\"","v":"Wysokość H [mm]"},null,null,null,null,{"$f":"logic!$L$4","v":"Długość"},null,null,null,null,{"$f":"logic!$L$4","v":"Długość"},{"$f":"logic!$K$4&\" H [mm]\"","v":"Wysokość H [mm]"},null,null,null,null,{"$f":"logic!$K$4&\" H [mm]\"","v":"Wysokość H [mm]"},null,null,null,null,{"$f":"logic!$L$4","v":"Długość"}]
[null,null,{"$f":"\"L [\"&logic!$O$64&\"]\"","v":"L [mm]"},{"$f":"IF(logic!$K$64=2,výkony!C16/logic!$M$64,výkony!C16)","v":700},{"$f":"IF(logic!$K$64=2,výkony!D16/logic!$M$64,výkony!D16)","v":900},{"$f":"IF(logic!$K$64=2,výkony!E16/logic!$M$64,výkony!E16)","v":1220},{"$f":"IF(logic!$K$64=2,výkony!F16/logic!$M$64,výkony!F16)","v":1500},{"$f":"IF(logic!$K$64=2,výkony!G16/logic!$M$64,výkony!G16)","v":1820},{"$f":"IF(logic!$K$64=2,výkony!H16/logic!$M$64,výkony!H16)","v":700},{"$f":"IF(logic!$K$64=2,výkony!I16/logic!$M$64,výkony!I16)","v":900},{"$f":"IF(logic!$K$64=2,výkony!J16/logic!$M$64,výkony!J16)","v":1220},{"$f":"IF(logic!$K$64=2,výkony!K16/logic!$M$64,výkony!K16)","v":1500},{"$f":"IF(logic!$K$64=2,výkony!L16/logic!$M$64,výkony!L16)","v":1820},{"$f":"\"L [\"&logic!$O$64&\"]\"","v":"L [mm]"},null,null,null,null,"L [mm]",700,900,1220,1500,1820,700,900,1220,1500,1820,"L [mm]"]
[null,{"$f":"IF(AND($K$5=logic!$I$4,$M$5=logic!$I$4),1,IF(AND(C16>=$K$5,C16<=$M$5),1,0))","v":1},{"$f":"IF(logic!$K$64=2,výkony!B17/logic!$M$64,výkony!B17)","v":450},{"$f":"IF(OR(D$12=0,$B16=0),0,IF(výkony!$D$8<0.7,IF(logic!$A$50=1,výkony!C17,výkony!P17),IF(logic!$A$50=1,výkony!AD17,výkony!AI17)))","v":320},{"$f":"IF(OR(E$12=0,$B16=0),0,IF(výkony!$D$8<0.7,IF(logic!$A$50=1,výkony!D17,výkony!Q17),IF(logic!$A$50=1,výkony!AE17,výkony!AJ17)))","v":411},{"$f":"IF(OR(F$12=0,$B16=0),0,IF(výkony!$D$8<0.7,IF(logic!$A$50=1,výkony!E17,výkony!R17),IF(logic!$A$50=1,výkony!AF17,výkony!AK17)))","v":557},{"$f":"IF(OR(G$12=0,$B16=0),0,IF(výkony!$D$8<0.7,IF(logic!$A$50=1,výkony!F17,výkony!S17),IF(logic!$A$50=1,výkony!AG17,výkony!AL17)))","v":686},{"$f":"IF(OR(H$12=0,$B16=0),0,IF(výkony!$D$8<0.7,IF(logic!$A$50=1,výkony!G17,výkony!T17),IF(logic!$A$50=1,výkony!AH17,výkony!AM17)))","v":833},{"$f":"IF(OR(I$12=0,$B16=0),0,IF(výkony!$D$8<0.7,IF(logic!$A$50=1,výkony!H17,výkony!U17),IF(logic!$A$50=1,výkony!AI17,výkony!AN17)))","v":320},{"$f":"IF(OR(J$12=0,$B16=0),0,IF(výkony!$D$8<0.7,IF(logic!$A$50=1,výkony!I17,výkony!V17),IF(logic!$A$50=1,výkony!AJ17,výkony!AO17)))","v":411},{"$f":"IF(OR(K$12=0,$B16=0),0,IF(výkony!$D$8<0.7,IF(logic!$A$50=1,výkony!J17,výkony!W17),IF(logic!$A$50=1,výkony!AK17,výkony!AP17)))","v":557},{"$f":"IF(OR(L$12=0,$B16=0),0,IF(výkony!$D$8<0.7,IF(logic!$A$50=1,výkony!K17,výkony!X17),IF(logic!$A$50=1,výkony!AL17,výkony!AQ17)))","v":686},{"$f":"IF(OR(M$12=0,$B16=0),0,IF(výkony!$D$8<0.7,IF(logic!$A$50=1,výkony!L17,výkony!Y17),IF(logic!$A$50=1,výkony!AM17,výkony!AR17)))","v":833},{"$f":"C16","v":450},null,null,null,null,450,{"$f":"\"KLM-\"&IF(LEN(T$15)=3,\"0\"&T$15/10,T$15/10)&\"0\"&$S16/10&\"-00-10\"","v":"KLM-070045-00-10"},{"$f":"\"KLM-\"&IF(LEN(U$15)=3,\"0\"&U$15/10,U$15/10)&\"0\"&$S16/10&\"-00-10\"","v":"KLM-090045-00-10"},"KLM-122045-00-10","KLM-150045-00-10","KLM-182045-00-10",{"$f":"\"KLM-\"&IF(LEN(Y$15)=3,\"0\"&Y$15/10,Y$15/10)&\"0\"&$S16/10&\"-00M10\"","v":"KLM-070045-00M10"},{"$f":"\"KLM-\"&IF(LEN(Z$15)=3,\"0\"&Z$15/10,Z$15/10)&\"0\"&$S16/10&\"-00M10\"","v":"KLM-090045-00M10"},"KLM-122045-00M10","KLM-150045-00M10","KLM-182045-00M10",450]
[null,{"$f":"IF(AND($K$5=logic!$I$4,$M$5=logic!$I$4),1,IF(AND(C17>=$K$5,C17<=$M$5),1,0))","v":1},{"$f":"IF(logic!$K$64=2,výkony!B18/logic!$M$64,výkony!B18)","v":600},{"$f":"IF(OR(D$12=0,$B17=0),0,IF(výkony!$D$8<0.7,IF(logic!$A$50=1,výkony!C18,výkony!P18),IF(logic!$A$50=1,výkony!AD18,výkony!AI18)))","v":422},{"$f":"IF(OR(E$12=0,$B17=0),0,IF(výkony!$D$8<0.7,IF(logic!$A$50=1,výkony!D18,výkony!Q18),IF(logic!$A$50=1,výkony!AE18,výkony!AJ18)))","v":543},{"$f":"IF(OR(F$12=0,$B17=0),0,IF(výkony!$D$8<0.7,IF(logic!$A$50=1,výkony!E18,výkony!R18),IF(logic!$A$50=1,výkony!AF18,výkony!AK18)))","v":736},{"$f":"IF(OR(G$12=0,$B17=0),0,IF(výkony!$D$8<0.7,IF(logic!$A$50=1,výkony!F18,výkony!S18),IF(logic!$A$50=1,výkony!AG18,výkony!AL18)))","v":906},{"$f":"IF(OR(H$12=0,$B17=0),0,IF(výkony!$D$8<0.7,IF(logic!$A$50=1,výkony!G18,výkony!T18),IF(logic!$A$50=1,výkony!AH18,výkony!AM18)))","v":1101},{"$f":"IF(OR(I$12=0,$B17=0),0,IF(výkony!$D$8<0.7,IF(logic!$A$50=1,výkony!H18,výkony!U18),IF(logic!$A$50=1,výkony!AI18,výkony!AN18)))","v":422},{"$f":"IF(OR(J$12=0,$B17=0),0,IF(výkony!$D$8<0.7,IF(logic!$A$50=1,výkony!I18,výkony!V18),IF(logic!$A$50=1,výkony!AJ18,výkony!AO18)))","v":543},{"$f":"IF(OR(K$12=0,$B17=0),0,IF(výkony!$D$8<0.7,IF(logic!$A$50=1,výkony!J18,výkony!W18),IF(logic!$A$50=1,výkony!AK18,výkony!AP18)))","v":736},{"$f":"IF(OR(L$12=0,$B17=0),0,IF(výkony!$D$8<0.7,IF(logic!$A$50=1,výkony!K18,výkony!X18),IF(logic!$A$50=1,výkony!AL18,výkony!AQ18)))","v":906},{"$f":"IF(OR(M$12=0,$B17=0),0,IF(výkony!$D$8<0.7,IF(logic!$A$50=1,výkony!L18,výkony!Y18),IF(logic!$A$50=1,výkony!AM18,výkony!AR18)))","v":1101},{"$f":"C17","v":600},null,null,null,null,600,{"$f":"\"KLM-\"&IF(LEN(T$15)=3,\"0\"&T$15/10,T$15/10)&\"0\"&$S17/10&\"-00-10\"","v":"KLM-070060-00-10"},"KLM-090060-00-10","KLM-122060-00-10","KLM-150060-00-10","KLM-182060-00-10",{"$f":"\"KLM-\"&IF(LEN(Y$15)=3,\"0\"&Y$15/10,Y$15/10)&\"0\"&$S17/10&\"-00M10\"","v":"KLM-070060-00M10"},"KLM-090060-00M10","KLM-122060-00M10","KLM-150060-00M10","KLM-182060-00M10",600]
[null,{"$f":"IF(AND($K$5=logic!$I$4,$M$5=logic!$I$4),1,IF(AND(C18>=$K$5,C18<=$M$5),1,0))","v":1},{"$f":"IF(logic!$K$64=2,výkony!B19/logic!$M$64,výkony!B19)","v":750},{"$f":"IF(OR(D$12=0,$B18=0),0,IF(výkony!$D$8<0.7,IF(logic!$A$50=1,výkony!C19,výkony!P19),IF(logic!$A$50=1,výkony!AD19,výkony!AI19)))","v":524},{"$f":"IF(OR(E$12=0,$B18=0),0,IF(výkony!$D$8<0.7,IF(logic!$A$50=1,výkony!D19,výkony!Q19),IF(logic!$A$50=1,výkony!AE19,výkony!AJ19)))","v":673},{"$f":"IF(OR(F$12=0,$B18=0),0,IF(výkony!$D$8<0.7,IF(logic!$A$50=1,výkony!E19,výkony!R19),IF(logic!$A$50=1,výkony!AF19,výkony!AK19)))","v":913},{"$f":"IF(OR(G$12=0,$B18=0),0,IF(výkony!$D$8<0.7,IF(logic!$A$50=1,výkony!F19,výkony!S19),IF(logic!$A$50=1,výkony!AG19,výkony!AL19)))","v":1124},{"$f":"IF(OR(H$12=0,$B18=0),0,IF(výkony!$D$8<0.7,IF(logic!$A$50=1,výkony!G19,výkony!T19),IF(logic!$A$50=1,výkony!AH19,výkony!AM19)))","v":1367},{"$f":"IF(OR(I$12=0,$B18=0),0,IF(výkony!$D$8<0.7,IF(logic!$A$50=1,výkony!H19,výkony!U19),IF(logic!$A$50=1,výkony!AI19,výkony!AN19)))","v":524},{"$f":"IF(OR(J$12=0,$B18=0),0,IF(výkony!$D$8<0.7,IF(logic!$A$50=1,výkony!I19,výkony!V19),IF(logic!$A$50=1,výkony!AJ19,výkony!AO19)))","v":673},{"$f":"IF(OR(K$12=0,$B18=0),0,IF(výkony!$D$8<0.7,IF(logic!$A$50=1,výkony!J19,výkony!W19),IF(logic!$A$50=1,výkony!AK19,výkony!AP19)))","v":913},{"$f":"IF(OR(L$12=0,$B18=0),0,IF(výkony!$D$8<0.7,IF(logic!$A$50=1,výkony!K19,výkony!X19),IF(logic!$A$50=1,výkony!AL19,výkony!AQ19)))","v":1124},{"$f":"IF(OR(M$12=0,$B18=0),0,IF(výkony!$D$8<0.7,IF(logic!$A$50=1,výkony!L19,výkony!Y19),IF(logic!$A$50=1,výkony!AM19,výkony!AR19)))","v":1367},750,null,null,null,null,750,"KLM-070075-00-10","KLM-090075-00-10","KLM-122075-00-10","KLM-150075-00-10","KLM-182075-00-10","KLM-070075-00M10","KLM-090075-00M10","KLM-122075-00M10","KLM-150075-00M10","KLM-182075-00M10",750]
[]
[null,null,null,"KORALUX LINEAR COMFORT",null,null,null,null,"KORALUX LINEAR COMFORT - M",null,null,null,null,null,null,null,null,null,null,"KORALUX LINEAR COMFORT",null,null,null,null,"KORALUX LINEAR COMFORT - M"]
[null,null,{"$f":"logic!$L$4","v":"Długość"},{"$f":"logic!$K$4&\" H [\"&logic!$O$64&\"]\"","v":"Wysokość H [mm]"},null,null,null,null,{"$f":"logic!$K$4&\" H [\"&logic!$O$64&\"]\"","v":"Wysokość H [mm]"},null,null,null,null,{"$f":"logic!$L$4","v":"Długość"},null,null,null,null,{"$f":"logic!$L$4","v":"Długość"},{"$f":"logic!$K$4&\" H [mm]\"","v":"Wysokość H [mm]"},null,null,null,null,{"$f":"logic!$K$4&\" H [mm]\"","v":"Wysokość H [mm]"},null,null,null,null,{"$f":"logic!$L$4","v":"Długość"}]
[null,null,{"$f":"\"L [\"&logic!$O$64&\"]\"","v":"L [mm]"},{"$f":"IF(logic!$K$64=2,výkony!C23/logic!$M$64,výkony!C23)","v":700},{"$f":"IF(logic!$K$64=2,výkony!D23/logic!$M$64,výkony!D23)","v":900},{"$f":"IF(logic!$K$64=2,výkony!E23/logic!$M$64,výkony!E23)","v":1220},{"$f":"IF(logic!$K$64=2,výkony!F23/logic!$M$64,výkony!F23)","v":1500},{"$f":"IF(logic!$K$64=2,výkony!G23/logic!$M$64,výkony!G23)","v":1820},{"$f":"IF(logic!$K$64=2,výkony!H23/logic!$M$64,výkony!H23)","v":700},{"$f":"IF(logic!$K$64=2,výkony!I23/logic!$M$64,výkony!I23)","v":900},{"$f":"IF(logic!$K$64=2,výkony!J23/logic!$M$64,výkony!J23)","v":1220},{"$f":"IF(logic!$K$64=2,výkony!K23/logic!$M$64,výkony!K23)","v":1500},{"$f":"IF(logic!$K$64=2,výkony!L23/logic!$M$64,výkony!L23)","v":1820},{"$f":"\"L [\"&logic!$O$64&\"]\"","v":"L [mm]"},null,null,null,null,"L [mm]",700,900,1220,1500,1820,700,900,1220,1500,1820,"L [mm]"]
[null,{"$f":"IF(AND($K$5=logic!$I$4,$M$5=logic!$I$4),1,IF(AND(C23>=$K$5,C23<=$M$5),1,0))","v":1},{"$f":"IF(logic!$K$64=2,výkony!B24/logic!$M$64,výkony!B24)","v":450},{"$f":"IF(OR(D$12=0,$B23=0),0,IF(výkony!$D$8<0.7,IF(logic!$A$50=1,výkony!C24,výkony!P24),IF(logic!$A$50=1,výkony!AD24,výkony!AI24)))","v":287},{"$f":"IF(OR(E$12=0,$B23=0),0,IF(výkony!$D$8<0.7,IF(logic!$A$50=1,výkony!D24,výkony!Q24),IF(logic!$A$50=1,výkony!AE24,výkony!AJ24)))","v":369},{"$f":"IF(OR(F$12=0,$B23=0),0,IF(výkony!$D$8<0.7,IF(logic!$A$50=1,výkony!E24,výkony!R24),IF(logic!$A$50=1,výkony!AF24,výkony!AK24)))","v":504},{"$f":"IF(OR(G$12=0,$B23=0),0,IF(výkony!$D$8<0.7,IF(logic!$A$50=1,výkony!F24,výkony!S24),IF(logic!$A$50=1,výkony!AG24,výkony!AL24)))","v":626},{"$f":"IF(OR(H$12=0,$B23=0),0,IF(výkony!$D$8<0.7,IF(logic!$A$50=1,výkony!G24,výkony!T24),IF(logic!$A$50=1,výkony!AH24,výkony!AM24)))","v":772},{"$f":"IF(OR(I$12=0,$B23=0),0,IF(výkony!$D$8<0.7,IF(logic!$A$50=1,výkony!H24,výkony!U24),IF(logic!$A$50=1,výkony!AI24,výkony!AN24)))","v":287},{"$f":"IF(OR(J$12=0,$B23=0),0,IF(výkony!$D$8<0.7,IF(logic!$A$50=1,výkony!I24,výkony!V24),IF(logic!$A$50=1,výkony!AJ24,výkony!AO24)))","v":369},{"$f":"IF(OR(K$12=0,$B23=0),0,IF(výkony!$D$8<0.7,IF(logic!$A$50=1,výkony!J24,výkony!W24),IF(logic!$A$50=1,výkony!AK24,výkony!AP24)))","v":504},{"$f":"IF(OR(L$12=0,$B23=0),0,IF(výkony!$D$8<0.7,IF(logic!$A$50=1,výkony!K24,výkony!X24),IF(logic!$A$50=1,výkony!AL24,výkony!AQ24)))","v":626},{"$f":"IF(OR(M$12=0,$B23=0),0,IF(výkony!$D$8<0.7,IF(logic!$A$50=1,výkony!L24,výkony!Y24),IF(logic!$A$50=1,výkony!AM24,výkony!AR24)))","v":772},{"$f":"C23","v":450},null,null,null,null,450,{"$f":"\"KLT-\"&IF(LEN(T$22)=3,\"0\"&T$22/10,T$22/10)&\"0\"&$S23/10&\"-00-10\"","v":"KLT-070045-00-10"},{"$f":"\"KLT-\"&IF(LEN(U$22)=3,\"0\"&U$22/10,U$22/10)&\"0\"&$S23/10&\"-00-10\"","v":"KLT-090045-00-10"},"KLT-122045-00-10","KLT-150045-00-10","KLT-182045-00-10",{"$f":"\"KLT-\"&IF(LEN(Y$22)=3,\"0\"&Y$22/10,Y$22/10)&\"0\"&$S23/10&\"-00M10\"","v":"KLT-070045-00M10"},{"$f":"\"KLT-\"&IF(LEN(Z$22)=3,\"0\"&Z$22/10,Z$22/10)&\"0\"&$S23/10&\"-00M10\"","v":"KLT-090045-00M10"},"KLT-122045-00M10","KLT-150045-00M10","KLT-182045-00M10",450]
[null,{"$f":"IF(AND($K$5=logic!$I$4,$M$5=logic!$I$4),1,IF(AND(C24>=$K$5,C24<=$M$5),1,0))","v":1},{"$f":"IF(logic!$K$64=2,výkony!B25/logic!$M$64,výkony!B25)","v":500},{"$f":"IF(OR(D$12=0,$B24=0),0,IF(výkony!$D$8<0.7,IF(logic!$A$50=1,výkony!C25,výkony!P25),IF(logic!$A$50=1,výkony!AD25,výkony!AI25)))","v":315},{"$f":"IF(OR(E$12=0,$B24=0),0,IF(výkony!$D$8<0.7,IF(logic!$A$50=1,výkony!D25,výkony!Q25),IF(logic!$A$50=1,výkony!AE25,výkony!AJ25)))","v":405},{"$f":"IF(OR(F$12=0,$B24=0),0,IF(výkony!$D$8<0.7,IF(logic!$A$50=1,výkony!E25,výkony!R25),IF(logic!$A$50=1,výkony!AF25,výkony!AK25)))","v":553},{"$f":"IF(OR(G$12=0,$B24=0),0,IF(výkony!$D$8<0.7,IF(logic!$A$50=1,výkony!F25,výkony!S25),IF(logic!$A$50=1,výkony!AG25,výkony!AL25)))","v":687},{"$f":"IF(OR(H$12=0,$B24=0),0,IF(výkony!$D$8<0.7,IF(logic!$A$50=1,výkony!G25,výkony!T25),IF(logic!$A$50=1,výkony!AH25,výkony!AM25)))","v":848},{"$f":"IF(OR(I$12=0,$B24=0),0,IF(výkony!$D$8<0.7,IF(logic!$A$50=1,výkony!H25,výkony!U25),IF(logic!$A$50=1,výkony!AI25,výkony!AN25)))","v":315},{"$f":"IF(OR(J$12=0,$B24=0),0,IF(výkony!$D$8<0.7,IF(logic!$A$50=1,výkony!I25,výkony!V25),IF(logic!$A$50=1,výkony!AJ25,výkony!AO25)))","v":405},{"$f":"IF(OR(K$12=0,$B24=0),0,IF(výkony!$D$8<0.7,IF(logic!$A$50=1,výkony!J25,výkony!W25),IF(logic!$A$50=1,výkony!AK25,výkony!AP25)))","v":553},{"$f":"IF(OR(L$12=0,$B24=0),0,IF(výkony!$D$8<0.7,IF(logic!$A$50=1,výkony!K25,výkony!X25),IF(logic!$A$50=1,výkony!AL25,výkony!AQ25)))","v":687},{"$f":"IF(OR(M$12=0,$B24=0),0,IF(výkony!$D$8<0.7,IF(logic!$A$50=1,výkony!L25,výkony!Y25),IF(logic!$A$50=1,výkony!AM25,výkony!AR25)))","v":848},{"$f":"C24","v":500},null,null,null,null,500,{"$f":"\"KLT-\"&IF(LEN(T$22)=3,\"0\"&T$22/10,T$22/10)&\"0\"&$S24/10&\"-00-10\"","v":"KLT-070050-00-10"},"KLT-090050-00-10","KLT-122050-00-10","KLT-150050-00-10","KLT-182050-00-10",{"$f":"\"KLT-\"&IF(LEN(Y$22)=3,\"0\"&Y$22/10,Y$22/10)&\"0\"&$S24/10&\"-00M10\"","v":"KLT-070050-00M10"},"KLT-090050-00M10","KLT-122050-00M10","KLT-150050-00M10","KLT-182050-00M10",500]
[null,{"$f":"IF(AND($K$5=logic!$I$4,$M$5=logic!$I$4),1,IF(AND(C25>=$K$5,C25<=$M$5),1,0))","v":1},{"$f":"IF(logic!$K$64=2,výkony!B26/logic!$M$64,výkony!B26)","v":600},{"$f":"IF(OR(D$12=0,$B25=0),0,IF(výkony!$D$8<0.7,IF(logic!$A$50=1,výkony!C26,výkony!P26),IF(logic!$A$50=1,výkony!AD26,výkony!AI26)))","v":370},{"$f":"IF(OR(E$12=0,$B25=0),0,IF(výkony!$D$8<0.7,IF(logic!$A$50=1,výkony!D26,výkony!Q26),IF(logic!$A$50=1,výkony!AE26,výkony!AJ26)))","v":475},{"$f":"IF(OR(F$12=0,$B25=0),0,IF(výkony!$D$8<0.7,IF(logic!$A$50=1,výkony!E26,výkony!R26),IF(logic!$A$50=1,výkony!AF26,výkony!AK26)))","v":650},{"$f":"IF(OR(G$12=0,$B25=0),0,IF(výkony!$D$8<0.7,IF(logic!$A$50=1,výkony!F26,výkony!S26),IF(logic!$A$50=1,výkony!AG26,výkony!AL26)))","v":808},{"$f":"IF(OR(H$12=0,$B25=0),0,IF(výkony!$D$8<0.7,IF(logic!$A$50=1,výkony!G26,výkony!T26),IF(logic!$A$50=1,výkony!AH26,výkony!AM26)))","v":996},{"$f":"IF(OR(I$12=0,$B25=0),0,IF(výkony!$D$8<0.7,IF(logic!$A$50=1,výkony!H26,výkony!U26),IF(logic!$A$50=1,výkony!AI26,výkony!AN26)))","v":370},{"$f":"IF(OR(J$12=0,$B25=0),0,IF(výkony!$D$8<0.7,IF(logic!$A$50=1,výkony!I26,výkony!V26),IF(logic!$A$50=1,výkony!AJ26,výkony!AO26)))","v":475},{"$f":"IF(OR(K$12=0,$B25=0),0,IF(výkony!$D$8<0.7,IF(logic!$A$50=1,výkony!J26,výkony!W26),IF(logic!$A$50=1,výkony!AK26,výkony!AP26)))","v":650},{"$f":"IF(OR(L$12=0,$B25=0),0,IF(výkony!$D$8<0.7,IF(logic!$A$50=1,výkony!K26,výkony!X26),IF(logic!$A$50=1,výkony!AL26,výkony!AQ26)))","v":808},{"$f":"IF(OR(M$12=0,$B25=0),0,IF(výkony!$D$8<0.7,IF(logic!$A$50=1,výkony!L26,výkony!Y26),IF(logic!$A$50=1,výkony!AM26,výkony!AR26)))","v":996},600,null,null,null,null,600,"KLT-070060-00-10","KLT-090060-00-10","KLT-122060-00-10","KLT-150060-00-10","KLT-182060-00-10","KLT-070060-00M10","KLT-090060-00M10","KLT-122060-00M10","KLT-150060-00M10","KLT-182060-00M10",600]
[null,{"$f":"IF(AND($K$5=logic!$I$4,$M$5=logic!$I$4),1,IF(AND(C26>=$K$5,C26<=$M$5),1,0))","v":1},{"$f":"IF(logic!$K$64=2,výkony!B27/logic!$M$64,výkony!B27)","v":750},{"$f":"IF(OR(D$12=0,$B26=0),0,IF(výkony!$D$8<0.7,IF(logic!$A$50=1,výkony!C27,výkony!P27),IF(logic!$A$50=1,výkony!AD27,výkony!AI27)))","v":450},{"$f":"IF(OR(E$12=0,$B26=0),0,IF(výkony!$D$8<0.7,IF(logic!$A$50=1,výkony!D27,výkony!Q27),IF(logic!$A$50=1,výkony!AE27,výkony!AJ27)))","v":579},{"$f":"IF(OR(F$12=0,$B26=0),0,IF(výkony!$D$8<0.7,IF(logic!$A$50=1,výkony!E27,výkony!R27),IF(logic!$A$50=1,výkony!AF27,výkony!AK27)))","v":791},{"$f":"IF(OR(G$12=0,$B26=0),0,IF(výkony!$D$8<0.7,IF(logic!$A$50=1,výkony!F27,výkony!S27),IF(logic!$A$50=1,výkony!AG27,výkony!AL27)))","v":984},{"$f":"IF(OR(H$12=0,$B26=0),0,IF(výkony!$D$8<0.7,IF(logic!$A$50=1,výkony!G27,výkony!T27),IF(logic!$A$50=1,výkony!AH27,výkony!AM27)))","v":1213},{"$f":"IF(OR(I$12=0,$B26=0),0,IF(výkony!$D$8<0.7,IF(logic!$A$50=1,výkony!H27,výkony!U27),IF(logic!$A$50=1,výkony!AI27,výkony!AN27)))","v":450},{"$f":"IF(OR(J$12=0,$B26=0),0,IF(výkony!$D$8<0.7,IF(logic!$A$50=1,výkony!I27,výkony!V27),IF(logic!$A$50=1,výkony!AJ27,výkony!AO27)))","v":579},{"$f":"IF(OR(K$12=0,$B26=0),0,IF(výkony!$D$8<0.7,IF(logic!$A$50=1,výkony!J27,výkony!W27),IF(logic!$A$50=1,výkony!AK27,výkony!AP27)))","v":791},{"$f":"IF(OR(L$12=0,$B26=0),0,IF(výkony!$D$8<0.7,IF(logic!$A$50=1,výkony!K27,výkony!X27),IF(logic!$A$50=1,výkony!AL27,výkony!AQ27)))","v":984},{"$f":"IF(OR(M$12=0,$B26=0),0,IF(výkony!$D$8<0.7,IF(logic!$A$50=1,výkony!L27,výkony!Y27),IF(logic!$A$50=1,výkony!AM27,výkony!AR27)))","v":1213},750,null,null,null,null,750,"KLT-070075-00-10","KLT-090075-00-10","KLT-122075-00-10","KLT-150075-00-10","KLT-182075-00-10","KLT-070075-00M10","KLT-090075-00M10","KLT-122075-00M10","KLT-150075-00M10","KLT-182075-00M10",750]
[]
[null,null,null,"KORALUX LINEAR CLASSIC",null,null,null,null,"KORALUX LINEAR CLASSIC - M",null,null,null,null,null,null,null,null,null,null,"KORALUX LINEAR CLASSIC",null,null,null,null,"KORALUX LINEAR CLASSIC - M"]
[null,null,{"$f":"logic!$L$4","v":"Długość"},{"$f":"logic!$K$4&\" H [\"&logic!$O$64&\"]\"","v":"Wysokość H [mm]"},null,null,null,null,{"$f":"logic!$K$4&\" H [\"&logic!$O$64&\"]\"","v":"Wysokość H [mm]"},null,null,null,null,{"$f":"logic!$L$4","v":"Długość"},null,null,null,null,{"$f":"logic!$L$4","v":"Długość"},{"$f":"logic!$K$4&\" H [mm]\"","v":"Wysokość H [mm]"},null,null,null,null,{"$f":"logic!$K$4&\" H [mm]\"","v":"Wysokość H [mm]"},null,null,null,null,{"$f":"logic!$L$4","v":"Długość"}]
[null,null,{"$f":"\"L [\"&logic!$O$64&\"]\"","v":"L [mm]"},{"$f":"IF(logic!$K$64=2,výkony!C31/logic!$M$64,výkony!C31)","v":700},{"$f":"IF(logic!$K$64=2,výkony!D31/logic!$M$64,výkony!D31)","v":900},{"$f":"IF(logic!$K$64=2,výkony!E31/logic!$M$64,výkony!E31)","v":1220},{"$f":"IF(logic!$K$64=2,výkony!F31/logic!$M$64,výkony!F31)","v":1500},{"$f":"IF(logic!$K$64=2,výkony!G31/logic!$M$64,výkony!G31)","v":1820},{"$f":"IF(logic!$K$64=2,výkony!H31/logic!$M$64,výkony!H31)","v":700},{"$f":"IF(logic!$K$64=2,výkony!I31/logic!$M$64,výkony!I31)","v":900},{"$f":"IF(logic!$K$64=2,výkony!J31/logic!$M$64,výkony!J31)","v":1220},{"$f":"IF(logic!$K$64=2,výkony!K31/logic!$M$64,výkony!K31)","v":1500},{"$f":"IF(logic!$K$64=2,výkony!L31/logic!$M$64,výkony!L31)","v":1820},{"$f":"\"L [\"&logic!$O$64&\"]\"","v":"L [mm]"},null,null,null,null,"L [mm]",700,900,1220,1500,1820,700,900,1220,1500,1820,"L [mm]"]
[null,{"$f":"IF(AND($K$5=logic!$I$4,$M$5=logic!$I$4),1,IF(AND(C31>=$K$5,C31<=$M$5),1,0))","v":1},{"$f":"IF(logic!$K$64=2,výkony!B32/logic!$M$64,výkony!B32)","v":450},{"$f":"IF(OR(D$12=0,$B31=0),0,IF(výkony!$D$8<0.7,IF(logic!$A$50=1,výkony!C32,výkony!P32),IF(logic!$A$50=1,výkony!AD32,výkony!AI32)))","v":255},{"$f":"IF(OR(E$12=0,$B31=0),0,IF(výkony!$D$8<0.7,IF(logic!$A$50=1,výkony!D32,výkony!Q32),IF(logic!$A$50=1,výkony!AE32,výkony!AJ32)))","v":333},{"$f":"IF(OR(F$12=0,$B31=0),0,IF(výkony!$D$8<0.7,IF(logic!$A$50=1,výkony!E32,výkony!R32),IF(logic!$A$50=1,výkony!AF32,výkony!AK32)))","v":462},{"$f":"IF(OR(G$12=0,$B31=0),0,IF(výkony!$D$8<0.7,IF(logic!$A$50=1,výkony!F32,výkony!S32),IF(logic!$A$50=1,výkony!AG32,výkony!AL32)))","v":581},{"$f":"IF(OR(H$12=0,$B31=0),0,IF(výkony!$D$8<0.7,IF(logic!$A$50=1,výkony!G32,výkony!T32),IF(logic!$A$50=1,výkony!AH32,výkony!AM32)))","v":725},{"$f":"IF(OR(I$12=0,$B31=0),0,IF(výkony!$D$8<0.7,IF(logic!$A$50=1,výkony!H32,výkony!U32),IF(logic!$A$50=1,výkony!AI32,výkony!AN32)))","v":255},{"$f":"IF(OR(J$12=0,$B31=0),0,IF(výkony!$D$8<0.7,IF(logic!$A$50=1,výkony!I32,výkony!V32),IF(logic!$A$50=1,výkony!AJ32,výkony!AO32)))","v":333},{"$f":"IF(OR(K$12=0,$B31=0),0,IF(výkony!$D$8<0.7,IF(logic!$A$50=1,výkony!J32,výkony!W32),IF(logic!$A$50=1,výkony!AK32,výkony!AP32)))","v":462},{"$f":"IF(OR(L$12=0,$B31=0),0,IF(výkony!$D$8<0.7,IF(logic!$A$50=1,výkony!K32,výkony!X32),IF(logic!$A$50=1,výkony!AL32,výkony!AQ32)))","v":581},{"$f":"IF(OR(M$12=0,$B31=0),0,IF(výkony!$D$8<0.7,IF(logic!$A$50=1,výkony!L32,výkony!Y32),IF(logic!$A$50=1,výkony!AM32,výkony!AR32)))","v":725},{"$f":"C31","v":450},null,null,null,null,450,{"$f":"\"KLC-\"&IF(LEN(T$30)=3,\"0\"&T$30/10,T$30/10)&\"0\"&$S31/10&\"-00-10\"","v":"KLC-070045-00-10"},{"$f":"\"KLC-\"&IF(LEN(U$30)=3,\"0\"&U$30/10,U$30/10)&\"0\"&$S31/10&\"-00-10\"","v":"KLC-090045-00-10"},"KLC-122045-00-10","KLC-150045-00-10","KLC-182045-00-10",{"$f":"\"KLC-\"&IF(LEN(Y$30)=3,\"0\"&Y$30/10,Y$30/10)&\"0\"&$S31/10&\"-00M10\"","v":"KLC-070045-00M10"},{"$f":"\"KLC-\"&IF(LEN(Z$30)=3,\"0\"&Z$30/10,Z$30/10)&\"0\"&$S31/10&\"-00M10\"","v":"KLC-090045-00M10"},"KLC-122045-00M10","KLC-150045-00M10","KLC-182045-00M10",450]
[null,{"$f":"IF(AND($K$5=logic!$I$4,$M$5=logic!$I$4),1,IF(AND(C32>=$K$5,C32<=$M$5),1,0))","v":1},{"$f":"IF(logic!$K$64=2,výkony!B33/logic!$M$64,výkony!B33)","v":500},{"$f":"IF(OR(D$12=0,$B32=0),0,IF(výkony!$D$8<0.7,IF(logic!$A$50=1,výkony!C33,výkony!P33),IF(logic!$A$50=1,výkony!AD33,výkony!AI33)))","v":280},{"$f":"IF(OR(E$12=0,$B32=0),0,IF(výkony!$D$8<0.7,IF(logic!$A$50=1,výkony!D33,výkony!Q33),IF(logic!$A$50=1,výkony!AE33,výkony!AJ33)))","v":365},{"$f":"IF(OR(F$12=0,$B32=0),0,IF(výkony!$D$8<0.7,IF(logic!$A$50=1,výkony!E33,výkony!R33),IF(logic!$A$50=1,výkony!AF33,výkony!AK33)))","v":507},{"$f":"IF(OR(G$12=0,$B32=0),0,IF(výkony!$D$8<0.7,IF(logic!$A$50=1,výkony!F33,výkony!S33),IF(logic!$A$50=1,výkony!AG33,výkony!AL33)))","v":638},{"$f":"IF(OR(H$12=0,$B32=0),0,IF(výkony!$D$8<0.7,IF(logic!$A$50=1,výkony!G33,výkony!T33),IF(logic!$A$50=1,výkony!AH33,výkony!AM33)))","v":795},{"$f":"IF(OR(I$12=0,$B32=0),0,IF(výkony!$D$8<0.7,IF(logic!$A$50=1,výkony!H33,výkony!U33),IF(logic!$A$50=1,výkony!AI33,výkony!AN33)))","v":280},{"$f":"IF(OR(J$12=0,$B32=0),0,IF(výkony!$D$8<0.7,IF(logic!$A$50=1,výkony!I33,výkony!V33),IF(logic!$A$50=1,výkony!AJ33,výkony!AO33)))","v":365},{"$f":"IF(OR(K$12=0,$B32=0),0,IF(výkony!$D$8<0.7,IF(logic!$A$50=1,výkony!J33,výkony!W33),IF(logic!$A$50=1,výkony!AK33,výkony!AP33)))","v":507},{"$f":"IF(OR(L$12=0,$B32=0),0,IF(výkony!$D$8<0.7,IF(logic!$A$50=1,výkony!K33,výkony!X33),IF(logic!$A$50=1,výkony!AL33,výkony!AQ33)))","v":638},{"$f":"IF(OR(M$12=0,$B32=0),0,IF(výkony!$D$8<0.7,IF(logic!$A$50=1,výkony!L33,výkony!Y33),IF(logic!$A$50=1,výkony!AM33,výkony!AR33)))","v":795},{"$f":"C32","v":500},null,null,null,null,500,{"$f":"\"KLC-\"&IF(LEN(T$30)=3,\"0\"&T$30/10,T$30/10)&\"0\"&$S32/10&\"-00-10\"","v":"KLC-070050-00-10"},"KLC-090050-00-10","KLC-122050-00-10","KLC-150050-00-10","KLC-182050-00-10",{"$f":"\"KLC-\"&IF(LEN(Y$30)=3,\"0\"&Y$30/10,Y$30/10)&\"0\"&$S32/10&\"-00M10\"","v":"KLC-070050-00M10"},"KLC-090050-00M10","KLC-122050-00M10","KLC-150050-00M10","KLC-182050-00M10",500]
[null,{"$f":"IF(AND($K$5=logic!$I$4,$M$5=logic!$I$4),1,IF(AND(C33>=$K$5,C33<=$M$5),1,0))","v":1},{"$f":"IF(logic!$K$64=2,výkony!B34/logic!$M$64,výkony!B34)","v":600},{"$f":"IF(OR(D$12=0,$B33=0),0,IF(výkony!$D$8<0.7,IF(logic!$A$50=1,výkony!C34,výkony!P34),IF(logic!$A$50=1,výkony!AD34,výkony!AI34)))","v":329},{"$f":"IF(OR(E$12=0,$B33=0),0,IF(výkony!$D$8<0.7,IF(logic!$A$50=1,výkony!D34,výkony!Q34),IF(logic!$A$50=1,výkony!AE34,výkony!AJ34)))","v":429},{"$f":"IF(OR(F$12=0,$B33=0),0,IF(výkony!$D$8<0.7,IF(logic!$A$50=1,výkony!E34,výkony!R34),IF(logic!$A$50=1,výkony!AF34,výkony!AK34)))","v":596},{"$f":"IF(OR(G$12=0,$B33=0),0,IF(výkony!$D$8<0.7,IF(logic!$A$50=1,výkony!F34,výkony!S34),IF(logic!$A$50=1,výkony!AG34,výkony!AL34)))","v":750},{"$f":"IF(OR(H$12=0,$B33=0),0,IF(výkony!$D$8<0.7,IF(logic!$A$50=1,výkony!G34,výkony!T34),IF(logic!$A$50=1,výkony!AH34,výkony!AM34)))","v":934},{"$f":"IF(OR(I$12=0,$B33=0),0,IF(výkony!$D$8<0.7,IF(logic!$A$50=1,výkony!H34,výkony!U34),IF(logic!$A$50=1,výkony!AI34,výkony!AN34)))","v":329},{"$f":"IF(OR(J$12=0,$B33=0),0,IF(výkony!$D$8<0.7,IF(logic!$A$50=1,výkony!I34,výkony!V34),IF(logic!$A$50=1,výkony!AJ34,výkony!AO34)))","v":429},{"$f":"IF(OR(K$12=0,$B33=0),0,IF(výkony!$D$8<0.7,IF(logic!$A$50=1,výkony!J34,výkony!W34),IF(logic!$A$50=1,výkony!AK34,výkony!AP34)))","v":596},{"$f":"IF(OR(L$12=0,$B33=0),0,IF(výkony!$D$8<0.7,IF(logic!$A$50=1,výkony!K34,výkony!X34),IF(logic!$A$50=1,výkony!AL34,výkony!AQ34)))","v":750},{"$f":"IF(OR(M$12=0,$B33=0),0,IF(výkony!$D$8<0.7,IF(logic!$A$50=1,výkony!L34,výkony!Y34),IF(logic!$A$50=1,výkony!AM34,výkony!AR34)))","v":934},600,null,null,null,null,600,"KLC-070060-00-10","KLC-090060-00-10","KLC-122060-00-10","KLC-150060-00-10","KLC-182060-00-10","KLC-070060-00M10","KLC-090060-00M10","KLC-122060-00M10","KLC-150060-00M10","KLC-182060-00M10",600]
[null,{"$f":"IF(AND($K$5=logic!$I$4,$M$5=logic!$I$4),1,IF(AND(C34>=$K$5,C34<=$M$5),1,0))","v":1},{"$f":"IF(logic!$K$64=2,výkony!B35/logic!$M$64,výkony!B35)","v":750},{"$f":"IF(OR(D$12=0,$B34=0),0,IF(výkony!$D$8<0.7,IF(logic!$A$50=1,výkony!C35,výkony!P35),IF(logic!$A$50=1,výkony!AD35,výkony!AI35)))","v":400},{"$f":"IF(OR(E$12=0,$B34=0),0,IF(výkony!$D$8<0.7,IF(logic!$A$50=1,výkony!D35,výkony!Q35),IF(logic!$A$50=1,výkony!AE35,výkony!AJ35)))","v":522},{"$f":"IF(OR(F$12=0,$B34=0),0,IF(výkony!$D$8<0.7,IF(logic!$A$50=1,výkony!E35,výkony!R35),IF(logic!$A$50=1,výkony!AF35,výkony!AK35)))","v":726},{"$f":"IF(OR(G$12=0,$B34=0),0,IF(výkony!$D$8<0.7,IF(logic!$A$50=1,výkony!F35,výkony!S35),IF(logic!$A$50=1,výkony!AG35,výkony!AL35)))","v":913},{"$f":"IF(OR(H$12=0,$B34=0),0,IF(výkony!$D$8<0.7,IF(logic!$A$50=1,výkony!G35,výkony!T35),IF(logic!$A$50=1,výkony!AH35,výkony!AM35)))","v":1138},{"$f":"IF(OR(I$12=0,$B34=0),0,IF(výkony!$D$8<0.7,IF(logic!$A$50=1,výkony!H35,výkony!U35),IF(logic!$A$50=1,výkony!AI35,výkony!AN35)))","v":400},{"$f":"IF(OR(J$12=0,$B34=0),0,IF(výkony!$D$8<0.7,IF(logic!$A$50=1,výkony!I35,výkony!V35),IF(logic!$A$50=1,výkony!AJ35,výkony!AO35)))","v":522},{"$f":"IF(OR(K$12=0,$B34=0),0,IF(výkony!$D$8<0.7,IF(logic!$A$50=1,výkony!J35,výkony!W35),IF(logic!$A$50=1,výkony!AK35,výkony!AP35)))","v":726},{"$f":"IF(OR(L$12=0,$B34=0),0,IF(výkony!$D$8<0.7,IF(logic!$A$50=1,výkony!K35,výkony!X35),IF(logic!$A$50=1,výkony!AL35,výkony!AQ35)))","v":913},{"$f":"IF(OR(M$12=0,$B34=0),0,IF(výkony!$D$8<0.7,IF(logic!$A$50=1,výkony!L35,výkony!Y35),IF(logic!$A$50=1,výkony!AM35,výkony!AR35)))","v":1138},750,null,null,null,null,750,"KLC-070075-00-10","KLC-090075-00-10","KLC-122075-00-10","KLC-150075-00-10","KLC-182075-00-10","KLC-070075-00M10","KLC-090075-00M10","KLC-122075-00M10","KLC-150075-00M10","KLC-182075-00M10",750]
[null,null,null,null,null,null,null,null,null,{"$f":"IF(logic!$A$50=2,0,IF(AND($K$4=logic!$I$4,$M$4=logic!$I$4),1,IF(AND(J39>=$K$4,F15<=$M$4),1,0)))","v":1},{"$f":"IF(logic!$A$50=2,0,IF(AND($K$4=logic!$I$4,$M$4=logic!$I$4),1,IF(AND(K39>=$K$4,G15<=$M$4),1,0)))","v":1},{"$f":"IF(logic!$A$50=2,0,IF(AND($K$4=logic!$I$4,$M$4=logic!$I$4),1,IF(AND(L39>=$K$4,H15<=$M$4),1,0)))","v":1}]
[null,null,null,"KORALUX STANDARD",null,null,null,null,null,null,null,null,null,null,null,null,null,null,null,"KORALUX STANDARD",null,null,null,null,null,"KORALUX NEO"]
[null,null,{"$f":"logic!$L$4","v":"Długość"},{"$f":"logic!$K$4&\" H [\"&logic!$O$64&\"]\"","v":"Wysokość H [mm]"},null,null,null,null,null,"KORALUX NEO",null,null,null,null,null,null,null,null,{"$f":"logic!$L$4","v":"Długość"},{"$f":"logic!$K$4&\" H [mm]\"","v":"Wysokość H [mm]"},null,null,null,null,{"$f":"logic!$L$4","v":"Długość"},{"$f":"logic!$K$4&\" H [\"&logic!$O$64&\"]\"","v":"Wysokość H [mm]"}]
[null,null,{"$f":"\"L [\"&logic!$O$64&\"]\"","v":"L [mm]"},{"$f":"IF(logic!$K$64=2,výkony!C39/logic!$M$64,výkony!C39)","v":700},{"$f":"IF(logic!$K$64=2,výkony!D39/logic!$M$64,výkony!D39)","v":900},{"$f":"IF(logic!$K$64=2,výkony!E39/logic!$M$64,výkony!E39)","v":1220},{"$f":"IF(logic!$K$64=2,výkony!F39/logic!$M$64,výkony!F39)","v":1500},null,{"$f":"logic!$L$4","v":"Długość"},{"$f":"logic!$K$4&\" H [\"&logic!$O$64&\"]\"","v":"Wysokość H [mm]"},null,null,null,null,null,null,null,null,"L [mm]",700,900,1220,1500,null,{"$f":"\"L [\"&logic!$O$64&\"]\"","v":"L [mm]"},1100,1420,1700]
[null,{"$f":"IF(AND($K$5=logic!$I$4,$M$5=logic!$I$4),1,IF(C39=$K$5,1,0))","v":1},{"$f":"IF(logic!$K$64=2,výkony!B40/logic!$M$64,výkony!B40)","v":400},{"$f":"IF(OR(D$12=0,$B39=0),0,IF(výkony!$D$8<0.7,IF(logic!$A$50=1,výkony!C40,výkony!P40),IF(logic!$A$50=1,výkony!AD40,výkony!AI40)))","v":198},{"$f":"IF(OR(E$12=0,$B39=0),0,IF(výkony!$D$8<0.7,IF(logic!$A$50=1,výkony!D40,výkony!Q40),IF(logic!$A$50=1,výkony!AE40,výkony!AJ40)))","v":254},{"$f":"IF(OR(F$12=0,$B39=0),0,IF(výkony!$D$8<0.7,IF(logic!$A$50=1,výkony!E40,výkony!R40),IF(logic!$A$50=1,výkony!AF40,výkony!AK40)))","v":345},{"$f":"IF(OR(G$12=0,$B39=0),0,IF(výkony!$D$8<0.7,IF(logic!$A$50=1,výkony!F40,výkony!S40),IF(logic!$A$50=1,výkony!AG40,výkony!AL40)))","v":427},null,{"$f":"\"L [\"&logic!$O$64&\"]\"","v":"L [mm]"},{"$f":"IF(logic!$K$64=2,výkony!I40/logic!$M$64,výkony!I40)","v":1100},{"$f":"IF(logic!$K$64=2,výkony!J40/logic!$M$64,výkony!J40)","v":1420},{"$f":"IF(logic!$K$64=2,výkony!K40/logic!$M$64,výkony!K40)","v":1700},null,null,null,null,null,null,400,{"$f":"\"KSC-\"&IF(LEN(T$38)=3,\"0\"&T$38/10,T$38/10)&\"0\"&$S39/10&\"-00-10\"","v":"KSC-070040-00-10"},"KSC-090040-00-10","KSC-122040-00-10","KSC-150040-00-10",null,500,"KLN-110050-00-10","KLN-142050-00-10","KLN-170050-00-10"]
[null,{"$f":"IF(AND($K$5=logic!$I$4,$M$5=logic!$I$4),1,IF(AND(C40>=$K$5,C40<=$M$5),1,0))","v":1},{"$f":"IF(logic!$K$64=2,výkony!B41/logic!$M$64,výkony!B41)","v":500},{"$f":"IF(OR(D$12=0,$B40=0),0,IF(výkony!$D$8<0.7,IF(logic!$A$50=1,výkony!C41,výkony!P41),IF(logic!$A$50=1,výkony!AD41,výkony!AI41)))","v":231},{"$f":"IF(OR(E$12=0,$B40=0),0,IF(výkony!$D$8<0.7,IF(logic!$A$50=1,výkony!D41,výkony!Q41),IF(logic!$A$50=1,výkony!AE41,výkony!AJ41)))","v":297},{"$f":"IF(OR(F$12=0,$B40=0),0,IF(výkony!$D$8<0.7,IF(logic!$A$50=1,výkony!E41,výkony!R41),IF(logic!$A$50=1,výkony!AF41,výkony!AK41)))","v":403},{"$f":"IF(OR(G$12=0,$B40=0),0,IF(výkony!$D$8<0.7,IF(logic!$A$50=1,výkony!F41,výkony!S41),IF(logic!$A$50=1,výkony!AG41,výkony!AL41)))","v":499},null,{"$f":"IF(logic!$K$64=2,výkony!H41/logic!$M$64,výkony!H41)","v":500},{"$f":"IF(OR(J$12=0,$B40=0),0,IF(výkony!$D$8<0.7,IF(logic!$A$50=1,výkony!I41,výkony!V41),IF(logic!$A$50=1,výkony!AJ41,výkony!AW41)))","v":520},{"$f":"IF(OR(K$12=0,$B40=0),0,IF(výkony!$D$8<0.7,IF(logic!$A$50=1,výkony!J41,výkony!W41),IF(logic!$A$50=1,výkony!AK41,výkony!AX41)))","v":670},{"$f":"IF(OR(L$12=0,$B40=0),0,IF(výkony!$D$8<0.7,IF(logic!$A$50=1,výkony!K41,výkony!X41),IF(logic!$A$50=1,výkony!AL41,výkony!AY41)))","v":803},null,null,null,null,null,null,500,"KSC-070050-00-10","KSC-090050-00-10","KSC-122050-00-10","KSC-150050-00-10",null,600,"KLN-110060-00-10","KLN-142060-00-10","KLN-170060-00-10"]
[null,{"$f":"IF(AND($K$5=logic!$I$4,$M$5=logic!$I$4),1,IF(AND(C41>=$K$5,C41<=$M$5),1,0))","v":1},{"$f":"IF(logic!$K$64=2,výkony!B42/logic!$M$64,výkony!B42)","v":600},{"$f":"IF(OR(D$12=0,$B41=0),0,IF(výkony!$D$8<0.7,IF(logic!$A$50=1,výkony!C42,výkony!P42),IF(logic!$A$50=1,výkony!AD42,výkony!AI42)))","v":263},{"$f":"IF(OR(E$12=0,$B41=0),0,IF(výkony!$D$8<0.7,IF(logic!$A$50=1,výkony!D42,výkony!Q42),IF(logic!$A$50=1,výkony!AE42,výkony!AJ42)))","v":337},{"$f":"IF(OR(F$12=0,$B41=0),0,IF(výkony!$D$8<0.7,IF(logic!$A$50=1,výkony!E42,výkony!R42),IF(logic!$A$50=1,výkony!AF42,výkony!AK42)))","v":458},{"$f":"IF(OR(G$12=0,$B41=0),0,IF(výkony!$D$8<0.7,IF(logic!$A$50=1,výkony!F42,výkony!S42),IF(logic!$A$50=1,výkony!AG42,výkony!AL42)))","v":567},null,{"$f":"IF(logic!$K$64=2,výkony!H42/logic!$M$64,výkony!H42)","v":600},{"$f":"IF(OR(J$12=0,$B41=0),0,IF(výkony!$D$8<0.7,IF(logic!$A$50=1,výkony!I42,výkony!V42),IF(logic!$A$50=1,výkony!AJ42,výkony!AW42)))","v":593},{"$f":"IF(OR(K$12=0,$B41=0),0,IF(výkony!$D$8<0.7,IF(logic!$A$50=1,výkony!J42,výkony!W42),IF(logic!$A$50=1,výkony!AK42,výkony!AX42)))","v":763},{"$f":"IF(OR(L$12=0,$B41=0),0,IF(výkony!$D$8<0.7,IF(logic!$A$50=1,výkony!K42,výkony!X42),IF(logic!$A$50=1,výkony!AL42,výkony!AY42)))","v":914},null,null,null,null,null,null,600,"KSC-070060-00-10","KSC-090060-00-10","KSC-122060-00-10","KSC-150060-00-10"]
[]
[null,null,null,"KORALUX LINEAR EXCLUSIVE - M"]
[null,null,{"$f":"logic!$L$4","v":"Długość"},{"$f":"logic!$K$4&\" H [\"&logic!$O$64&\"]\"","v":"Wysokość H [mm]"}]
[null,null,{"$f":"\"L [\"&logic!$O$64&\"]\"","v":"L [mm]"},{"$f":"IF(logic!$K$64=2,výkony!C76/logic!$M$64,výkony!C76)","v":900},{"$f":"IF(logic!$K$64=2,výkony!D76/logic!$M$64,výkony!D76)","v":1220},{"$f":"IF(logic!$K$64=2,výkony!E76/logic!$M$64,výkony!E76)","v":1500},{"$f":"IF(logic!$K$64=2,výkony!F76/logic!$M$64,výkony!F76)","v":1820}]
[null,{"$f":"IF(AND($K$5=logic!$I$4,$M$5=logic!$I$4),1,IF(C46=$K$5,1,0))","v":1},{"$f":"IF(logic!$K$64=2,výkony!B77/logic!$M$64,výkony!B77)","v":450},{"$f":"IF(OR(D$12=0,$B46=0),0,IF(výkony!$D$8<0.7,IF(logic!$A$50=1,výkony!C47,výkony!P47),IF(logic!$A$50=1,výkony!AD47,výkony!AI47)))","v":249},{"$f":"IF(OR(E$12=0,$B46=0),0,IF(výkony!$D$8<0.7,IF(logic!$A$50=1,výkony!D47,výkony!Q47),IF(logic!$A$50=1,výkony!AE47,výkony!AJ47)))","v":338},{"$f":"IF(OR(F$12=0,$B46=0),0,IF(výkony!$D$8<0.7,IF(logic!$A$50=1,výkony!E47,výkony!R47),IF(logic!$A$50=1,výkony!AF47,výkony!AK47)))","v":419},{"$f":"IF(OR(G$12=0,$B46=0),0,IF(výkony!$D$8<0.7,IF(logic!$A$50=1,výkony!F47,výkony!S47),IF(logic!$A$50=1,výkony!AG47,výkony!AL47)))","v":516}]
[null,{"$f":"IF(AND($K$5=logic!$I$4,$M$5=logic!$I$4),1,IF(AND(C47>=$K$5,C47<=$M$5),1,0))","v":1},{"$f":"IF(logic!$K$64=2,výkony!B78/logic!$M$64,výkony!B78)","v":600},{"$f":"IF(OR(D$12=0,$B47=0),0,IF(výkony!$D$8<0.7,IF(logic!$A$50=1,výkony!C48,výkony!P48),IF(logic!$A$50=1,výkony!AD48,výkony!AI48)))","v":319},{"$f":"IF(OR(E$12=0,$B47=0),0,IF(výkony!$D$8<0.7,IF(logic!$A$50=1,výkony!D48,výkony!Q48),IF(logic!$A$50=1,výkony!AE48,výkony!AJ48)))","v":433},{"$f":"IF(OR(F$12=0,$B47=0),0,IF(výkony!$D$8<0.7,IF(logic!$A$50=1,výkony!E48,výkony!R48),IF(logic!$A$50=1,výkony!AF48,výkony!AK48)))","v":537},{"$f":"IF(OR(G$12=0,$B47=0),0,IF(výkony!$D$8<0.7,IF(logic!$A$50=1,výkony!F48,výkony!S48),IF(logic!$A$50=1,výkony!AG48,výkony!AL48)))","v":662}]
[null,{"$f":"IF(AND($K$5=logic!$I$4,$M$5=logic!$I$4),1,IF(AND(C48>=$K$5,C48<=$M$5),1,0))","v":1},{"$f":"IF(logic!$K$64=2,výkony!B79/logic!$M$64,výkony!B79)","v":750},{"$f":"IF(OR(D$12=0,$B48=0),0,IF(výkony!$D$8<0.7,IF(logic!$A$50=1,výkony!C49,výkony!P49),IF(logic!$A$50=1,výkony!AD49,výkony!AI49)))","v":387},{"$f":"IF(OR(E$12=0,$B48=0),0,IF(výkony!$D$8<0.7,IF(logic!$A$50=1,výkony!D49,výkony!Q49),IF(logic!$A$50=1,výkony!AE49,výkony!AJ49)))","v":526},{"$f":"IF(OR(F$12=0,$B48=0),0,IF(výkony!$D$8<0.7,IF(logic!$A$50=1,výkony!E49,výkony!R49),IF(logic!$A$50=1,výkony!AF49,výkony!AK49)))","v":652},{"$f":"IF(OR(G$12=0,$B48=0),0,IF(výkony!$D$8<0.7,IF(logic!$A$50=1,výkony!F49,výkony!S49),IF(logic!$A$50=1,výkony!AG49,výkony!AL49)))","v":802}]
[]
[null,null,null,"KORALUX RONDO MAX",null,null,null,null,"KORALUX RONDO MAX - M",null,null,null,null,null,null,null,null,null,null,"KORALUX RONDO MAX",null,null,null,null,"KORALUX RONDO MAX - M"]
[null,null,{"$f":"logic!$L$4","v":"Długość"},{"$f":"logic!$K$4&\" H [\"&logic!$O$64&\"]\"","v":"Wysokość H [mm]"},null,null,null,null,{"$f":"logic!$K$4&\" H [\"&logic!$O$64&\"]\"","v":"Wysokość H [mm]"},null,null,null,null,{"$f":"logic!$L$4","v":"Długość"},null,null,null,null,{"$f":"logic!$L$4","v":"Długość"},{"$f":"logic!$K$4&\" H [mm]\"","v":"Wysokość H [mm]"},null,null,null,null,{"$f":"logic!$K$4&\" H [mm]\"","v":"Wysokość H [mm]"},null,null,null,null,{"$f":"logic!$L$4","v":"Długość"}]
[null,null,{"$f":"\"L [\"&logic!$O$64&\"]\"","v":"L [mm]"},{"$f":"IF(logic!$K$64=2,výkony!C53/logic!$M$64,výkony!C53)","v":700},{"$f":"IF(logic!$K$64=2,výkony!D53/logic!$M$64,výkony!D53)","v":900},{"$f":"IF(logic!$K$64=2,výkony!E53/logic!$M$64,výkony!E53)","v":1220},{"$f":"IF(logic!$K$64=2,výkony!F53/logic!$M$64,výkony!F53)","v":1500},{"$f":"IF(logic!$K$64=2,výkony!G53/logic!$M$64,výkony!G53)","v":1820},{"$f":"IF(logic!$K$64=2,výkony!H53/logic!$M$64,výkony!H53)","v":700},{"$f":"IF(logic!$K$64=2,výkony!I53/logic!$M$64,výkony!I53)","v":900},{"$f":"IF(logic!$K$64=2,výkony!J53/logic!$M$64,výkony!J53)","v":1220},{"$f":"IF(logic!$K$64=2,výkony!K53/logic!$M$64,výkony!K53)","v":1500},{"$f":"IF(logic!$K$64=2,výkony!L53/logic!$M$64,výkony!L53)","v":1820},{"$f":"\"L [\"&logic!$O$64&\"]\"","v":"L [mm]"},null,null,null,null,"L [mm]",700,900,1220,1500,1820,700,900,1220,1500,1820,"L [mm]"]
[null,{"$f":"IF(AND($K$5=logic!$I$4,$M$5=logic!$I$4),1,IF(AND(C53>=$K$5,C53<=$M$5),1,0))","v":1},{"$f":"IF(logic!$K$64=2,výkony!B54/logic!$M$64,výkony!B54)","v":450},{"$f":"IF(OR(D$12=0,$B53=0),0,IF(výkony!$D$8<0.7,IF(logic!$A$50=1,výkony!C54,výkony!P54),IF(logic!$A$50=1,výkony!AD54,výkony!AI54)))","v":335},{"$f":"IF(OR(E$12=0,$B53=0),0,IF(výkony!$D$8<0.7,IF(logic!$A$50=1,výkony!D54,výkony!Q54),IF(logic!$A$50=1,výkony!AE54,výkony!AJ54)))","v":432},{"$f":"IF(OR(F$12=0,$B53=0),0,IF(výkony!$D$8<0.7,IF(logic!$A$50=1,výkony!E54,výkony!R54),IF(logic!$A$50=1,výkony!AF54,výkony!AK54)))","v":589},{"$f":"IF(OR(G$12=0,$B53=0),0,IF(výkony!$D$8<0.7,IF(logic!$A$50=1,výkony!F54,výkony!S54),IF(logic!$A$50=1,výkony!AG54,výkony!AL54)))","v":725},{"$f":"IF(OR(H$12=0,$B53=0),0,IF(výkony!$D$8<0.7,IF(logic!$A$50=1,výkony!G54,výkony!T54),IF(logic!$A$50=1,výkony!AH54,výkony!AM54)))","v":879},{"$f":"IF(OR(I$12=0,$B53=0),0,IF(výkony!$D$8<0.7,IF(logic!$A$50=1,výkony!H54,výkony!U54),IF(logic!$A$50=1,výkony!AI54,výkony!AN54)))","v":335},{"$f":"IF(OR(J$12=0,$B53=0),0,IF(výkony!$D$8<0.7,IF(logic!$A$50=1,výkony!I54,výkony!V54),IF(logic!$A$50=1,výkony!AJ54,výkony!AO54)))","v":432},{"$f":"IF(OR(K$12=0,$B53=0),0,IF(výkony!$D$8<0.7,IF(logic!$A$50=1,výkony!J54,výkony!W54),IF(logic!$A$50=1,výkony!AK54,výkony!AP54)))","v":589},{"$f":"IF(OR(L$12=0,$B53=0),0,IF(výkony!$D$8<0.7,IF(logic!$A$50=1,výkony!K54,výkony!X54),IF(logic!$A$50=1,výkony!AL54,výkony!AQ54)))","v":725},{"$f":"IF(OR(M$12=0,$B53=0),0,IF(výkony!$D$8<0.7,IF(logic!$A$50=1,výkony!L54,výkony!Y54),IF(logic!$A$50=1,výkony!AM54,výkony!AR54)))","v":879},{"$f":"C53","v":450},null,null,null,null,445,{"$f":"\"KRM-\"&IF(LEN(T$52)=3,\"0\"&T$52/10,T$52/10)&\"0\"&ROUND($S53/10,0)&\"-00-10\"","v":"KRM-070045-00-10"},{"$f":"\"KRM-\"&IF(LEN(U$52)=3,\"0\"&U$52/10,U$52/10)&\"0\"&ROUND($S53/10,0)&\"-00-10\"","v":"KRM-090045-00-10"},"KRM-122045-00-10","KRM-150045-00-10","KRM-182045-00-10",{"$f":"\"KRM-\"&IF(LEN(Y$52)=3,\"0\"&Y$52/10,Y$52/10)&\"0\"&ROUND($S53/10,0)&\"-00M10\"","v":"KRM-070045-00M10"},{"$f":"\"KRM-\"&IF(LEN(Z$52)=3,\"0\"&Z$52/10,Z$52/10)&\"0\"&ROUND($S53/10,0)&\"-00M10\"","v":"KRM-090045-00M10"},"KRM-122045-00M10","KRM-150045-00M10","KRM-182045-00M10",445]
[null,{"$f":"IF(AND($K$5=logic!$I$4,$M$5=logic!$I$4),1,IF(AND(C54>=$K$5,C54<=$M$5),1,0))","v":1},{"$f":"IF(logic!$K$64=2,výkony!B55/logic!$M$64,výkony!B55)","v":600},{"$f":"IF(OR(D$12=0,$B54=0),0,IF(výkony!$D$8<0.7,IF(logic!$A$50=1,výkony!C55,výkony!P55),IF(logic!$A$50=1,výkony!AD55,výkony!AI55)))","v":444},{"$f":"IF(OR(E$12=0,$B54=0),0,IF(výkony!$D$8<0.7,IF(logic!$A$50=1,výkony!D55,výkony!Q55),IF(logic!$A$50=1,výkony!AE55,výkony!AJ55)))","v":574},{"$f":"IF(OR(F$12=0,$B54=0),0,IF(výkony!$D$8<0.7,IF(logic!$A$50=1,výkony!E55,výkony!R55),IF(logic!$A$50=1,výkony!AF55,výkony!AK55)))","v":781},{"$f":"IF(OR(G$12=0,$B54=0),0,IF(výkony!$D$8<0.7,IF(logic!$A$50=1,výkony!F55,výkony!S55),IF(logic!$A$50=1,výkony!AG55,výkony!AL55)))","v":962},{"$f":"IF(OR(H$12=0,$B54=0),0,IF(výkony!$D$8<0.7,IF(logic!$A$50=1,výkony!G55,výkony!T55),IF(logic!$A$50=1,výkony!AH55,výkony!AM55)))","v":1166},{"$f":"IF(OR(I$12=0,$B54=0),0,IF(výkony!$D$8<0.7,IF(logic!$A$50=1,výkony!H55,výkony!U55),IF(logic!$A$50=1,výkony!AI55,výkony!AN55)))","v":444},{"$f":"IF(OR(J$12=0,$B54=0),0,IF(výkony!$D$8<0.7,IF(logic!$A$50=1,výkony!I55,výkony!V55),IF(logic!$A$50=1,výkony!AJ55,výkony!AO55)))","v":574},{"$f":"IF(OR(K$12=0,$B54=0),0,IF(výkony!$D$8<0.7,IF(logic!$A$50=1,výkony!J55,výkony!W55),IF(logic!$A$50=1,výkony!AK55,výkony!AP55)))","v":781},{"$f":"IF(OR(L$12=0,$B54=0),0,IF(výkony!$D$8<0.7,IF(logic!$A$50=1,výkony!K55,výkony!X55),IF(logic!$A$50=1,výkony!AL55,výkony!AQ55)))","v":962},{"$f":"IF(OR(M$12=0,$B54=0),0,IF(výkony!$D$8<0.7,IF(logic!$A$50=1,výkony!L55,výkony!Y55),IF(logic!$A$50=1,výkony!AM55,výkony!AR55)))","v":1166},{"$f":"C54","v":600},null,null,null,null,595,{"$f":"\"KRM-\"&IF(LEN(T$52)=3,\"0\"&T$52/10,T$52/10)&\"0\"&ROUND($S54/10,0)&\"-00-10\"","v":"KRM-070060-00-10"},"KRM-090060-00-10","KRM-122060-00-10","KRM-150060-00-10","KRM-182060-00-10",{"$f":"\"KRM-\"&IF(LEN(Y$52)=3,\"0\"&Y$52/10,Y$52/10)&\"0\"&ROUND($S54/10,0)&\"-00M10\"","v":"KRM-070060-00M10"},"KRM-090060-00M10","KRM-122060-00M10","KRM-150060-00M10","KRM-182060-00M10",595]
[null,{"$f":"IF(AND($K$5=logic!$I$4,$M$5=logic!$I$4),1,IF(AND(C55>=$K$5,C55<=$M$5),1,0))","v":1},{"$f":"IF(logic!$K$64=2,výkony!B56/logic!$M$64,výkony!B56)","v":750},{"$f":"IF(OR(D$12=0,$B55=0),0,IF(výkony!$D$8<0.7,IF(logic!$A$50=1,výkony!C56,výkony!P56),IF(logic!$A$50=1,výkony!AD56,výkony!AI56)))","v":553},{"$f":"IF(OR(E$12=0,$B55=0),0,IF(výkony!$D$8<0.7,IF(logic!$A$50=1,výkony!D56,výkony!Q56),IF(logic!$A$50=1,výkony!AE56,výkony!AJ56)))","v":714},{"$f":"IF(OR(F$12=0,$B55=0),0,IF(výkony!$D$8<0.7,IF(logic!$A$50=1,výkony!E56,výkony!R56),IF(logic!$A$50=1,výkony!AF56,výkony!AK56)))","v":973},{"$f":"IF(OR(G$12=0,$B55=0),0,IF(výkony!$D$8<0.7,IF(logic!$A$50=1,výkony!F56,výkony!S56),IF(logic!$A$50=1,výkony!AG56,výkony!AL56)))","v":1197},{"$f":"IF(OR(H$12=0,$B55=0),0,IF(výkony!$D$8<0.7,IF(logic!$A$50=1,výkony!G56,výkony!T56),IF(logic!$A$50=1,výkony!AH56,výkony!AM56)))","v":1452},{"$f":"IF(OR(I$12=0,$B55=0),0,IF(výkony!$D$8<0.7,IF(logic!$A$50=1,výkony!H56,výkony!U56),IF(logic!$A$50=1,výkony!AI56,výkony!AN56)))","v":553},{"$f":"IF(OR(J$12=0,$B55=0),0,IF(výkony!$D$8<0.7,IF(logic!$A$50=1,výkony!I56,výkony!V56),IF(logic!$A$50=1,výkony!AJ56,výkony!AO56)))","v":714},{"$f":"IF(OR(K$12=0,$B55=0),0,IF(výkony!$D$8<0.7,IF(logic!$A$50=1,výkony!J56,výkony!W56),IF(logic!$A$50=1,výkony!AK56,výkony!AP56)))","v":973},{"$f":"IF(OR(L$12=0,$B55=0),0,IF(výkony!$D$8<0.7,IF(logic!$A$50=1,výkony!K56,výkony!X56),IF(logic!$A$50=1,výkony!AL56,výkony!AQ56)))","v":1197},{"$f":"IF(OR(M$12=0,$B55=0),0,IF(výkony!$D$8<0.7,IF(logic!$A$50=1,výkony!L56,výkony!Y56),IF(logic!$A$50=1,výkony!AM56,výkony!AR56)))","v":1452},750,null,null,null,null,745,"KRM-070075-00-10","KRM-090075-00-10","KRM-122075-00-10","KRM-150075-00-10","KRM-182075-00-10","KRM-070075-00M10","KRM-090075-00M10","KRM-122075-00M10","KRM-150075-00M10","KRM-182075-00M10",745]
[]
[null,null,null,"KORALUX RONDO COMFORT",null,null,null,null,"KORALUX RONDO COMFORT - M",null,null,null,null,null,null,null,null,null,null,"KORALUX RONDO COMFORT",null,null,null,null,"KORALUX RONDO COMFORT - M"]
[null,null,{"$f":"logic!$L$4","v":"Długość"},{"$f":"logic!$K$4&\" H [\"&logic!$O$64&\"]\"","v":"Wysokość H [mm]"},null,null,null,null,{"$f":"logic!$K$4&\" H [\"&logic!$O$64&\"]\"","v":"Wysokość H [mm]"},null,null,null,null,{"$f":"logic!$L$4","v":"Długość"},null,null,null,null,{"$f":"logic!$L$4","v":"Długość"},{"$f":"logic!$K$4&\" H [mm]\"","v":"Wysokość H [mm]"},null,null,null,null,{"$f":"logic!$K$4&\" H [mm]\"","v":"Wysokość H [mm]"},null,null,null,null,{"$f":"logic!$L$4","v":"Długość"}]
[null,null,{"$f":"\"L [\"&logic!$O$64&\"]\"","v":"L [mm]"},{"$f":"IF(logic!$K$64=2,výkony!C60/logic!$M$64,výkony!C60)","v":700},{"$f":"IF(logic!$K$64=2,výkony!D60/logic!$M$64,výkony!D60)","v":900},{"$f":"IF(logic!$K$64=2,výkony!E60/logic!$M$64,výkony!E60)","v":1220},{"$f":"IF(logic!$K$64=2,výkony!F60/logic!$M$64,výkony!F60)","v":1500},{"$f":"IF(logic!$K$64=2,výkony!G60/logic!$M$64,výkony!G60)","v":1820},{"$f":"IF(logic!$K$64=2,výkony!H60/logic!$M$64,výkony!H60)","v":700},{"$f":"IF(logic!$K$64=2,výkony!I60/logic!$M$64,výkony!I60)","v":900},{"$f":"IF(logic!$K$64=2,výkony!J60/logic!$M$64,výkony!J60)","v":1220},{"$f":"IF(logic!$K$64=2,výkony!K60/logic!$M$64,výkony!K60)","v":1500},{"$f":"IF(logic!$K$64=2,výkony!L60/logic!$M$64,výkony!L60)","v":1820},{"$f":"\"L [\"&logic!$O$64&\"]\"","v":"L [mm]"},null,null,null,null,"L [mm]",700,900,1220,1500,1820,700,900,1220,1500,1820,"L [mm]"]
[null,{"$f":"IF(AND($K$5=logic!$I$4,$M$5=logic!$I$4),1,IF(AND(C60>=$K$5,C60<=$M$5),1,0))","v":1},{"$f":"IF(logic!$K$64=2,výkony!B61/logic!$M$64,výkony!B61)","v":450},{"$f":"IF(OR(D$12=0,$B60=0),0,IF(výkony!$D$8<0.7,IF(logic!$A$50=1,výkony!C61,výkony!P61),IF(logic!$A$50=1,výkony!AD61,výkony!AI61)))","v":287},{"$f":"IF(OR(E$12=0,$B60=0),0,IF(výkony!$D$8<0.7,IF(logic!$A$50=1,výkony!D61,výkony!Q61),IF(logic!$A$50=1,výkony!AE61,výkony!AJ61)))","v":369},{"$f":"IF(OR(F$12=0,$B60=0),0,IF(výkony!$D$8<0.7,IF(logic!$A$50=1,výkony!E61,výkony!R61),IF(logic!$A$50=1,výkony!AF61,výkony!AK61)))","v":504},{"$f":"IF(OR(G$12=0,$B60=0),0,IF(výkony!$D$8<0.7,IF(logic!$A$50=1,výkony!F61,výkony!S61),IF(logic!$A$50=1,výkony!AG61,výkony!AL61)))","v":626},{"$f":"IF(OR(H$12=0,$B60=0),0,IF(výkony!$D$8<0.7,IF(logic!$A$50=1,výkony!G61,výkony!T61),IF(logic!$A$50=1,výkony!AH61,výkony!AM61)))","v":772},{"$f":"IF(OR(I$12=0,$B60=0),0,IF(výkony!$D$8<0.7,IF(logic!$A$50=1,výkony!H61,výkony!U61),IF(logic!$A$50=1,výkony!AI61,výkony!AN61)))","v":287},{"$f":"IF(OR(J$12=0,$B60=0),0,IF(výkony!$D$8<0.7,IF(logic!$A$50=1,výkony!I61,výkony!V61),IF(logic!$A$50=1,výkony!AJ61,výkony!AO61)))","v":369},{"$f":"IF(OR(K$12=0,$B60=0),0,IF(výkony!$D$8<0.7,IF(logic!$A$50=1,výkony!J61,výkony!W61),IF(logic!$A$50=1,výkony!AK61,výkony!AP61)))","v":504},{"$f":"IF(OR(L$12=0,$B60=0),0,IF(výkony!$D$8<0.7,IF(logic!$A$50=1,výkony!K61,výkony!X61),IF(logic!$A$50=1,výkony!AL61,výkony!AQ61)))","v":626},{"$f":"IF(OR(M$12=0,$B60=0),0,IF(výkony!$D$8<0.7,IF(logic!$A$50=1,výkony!L61,výkony!Y61),IF(logic!$A$50=1,výkony!AM61,výkony!AR61)))","v":772},{"$f":"C60","v":450},null,null,null,null,445,{"$f":"\"KRT-\"&IF(LEN(T$59)=3,\"0\"&T$59/10,T$59/10)&\"0\"&ROUND($S60/10,0)&\"-00-10\"","v":"KRT-070045-00-10"},{"$f":"\"KRT-\"&IF(LEN(U$59)=3,\"0\"&U$59/10,U$59/10)&\"0\"&ROUND($S60/10,0)&\"-00-10\"","v":"KRT-090045-00-10"},"KRT-122045-00-10","KRT-150045-00-10","KRT-182045-00-10",{"$f":"\"KRT-\"&IF(LEN(Y$59)=3,\"0\"&Y$59/10,Y$59/10)&\"0\"&ROUND($S60/10,0)&\"-00M10\"","v":"KRT-070045-00M10"},{"$f":"\"KRT-\"&IF(LEN(Z$59)=3,\"0\"&Z$59/10,Z$59/10)&\"0\"&ROUND($S60/10,0)&\"-00M10\"","v":"KRT-090045-00M10"},"KRT-122045-00M10","KRT-150045-00M10","KRT-182045-00M10",445]
[null,{"$f":"IF(AND($K$5=logic!$I$4,$M$5=logic!$I$4),1,IF(AND(C61>=$K$5,C61<=$M$5),1,0))","v":1},{"$f":"IF(logic!$K$64=2,výkony!B62/logic!$M$64,výkony!B62)","v":500},{"$f":"IF(OR(D$12=0,$B61=0),0,IF(výkony!$D$8<0.7,IF(logic!$A$50=1,výkony!C62,výkony!P62),IF(logic!$A$50=1,výkony!AD62,výkony!AI62)))","v":315},{"$f":"IF(OR(E$12=0,$B61=0),0,IF(výkony!$D$8<0.7,IF(logic!$A$50=1,výkony!D62,výkony!Q62),IF(logic!$A$50=1,výkony!AE62,výkony!AJ62)))","v":405},{"$f":"IF(OR(F$12=0,$B61=0),0,IF(výkony!$D$8<0.7,IF(logic!$A$50=1,výkony!E62,výkony!R62),IF(logic!$A$50=1,výkony!AF62,výkony!AK62)))","v":553},{"$f":"IF(OR(G$12=0,$B61=0),0,IF(výkony!$D$8<0.7,IF(logic!$A$50=1,výkony!F62,výkony!S62),IF(logic!$A$50=1,výkony!AG62,výkony!AL62)))","v":687},{"$f":"IF(OR(H$12=0,$B61=0),0,IF(výkony!$D$8<0.7,IF(logic!$A$50=1,výkony!G62,výkony!T62),IF(logic!$A$50=1,výkony!AH62,výkony!AM62)))","v":848},{"$f":"IF(OR(I$12=0,$B61=0),0,IF(výkony!$D$8<0.7,IF(logic!$A$50=1,výkony!H62,výkony!U62),IF(logic!$A$50=1,výkony!AI62,výkony!AN62)))","v":315},{"$f":"IF(OR(J$12=0,$B61=0),0,IF(výkony!$D$8<0.7,IF(logic!$A$50=1,výkony!I62,výkony!V62),IF(logic!$A$50=1,výkony!AJ62,výkony!AO62)))","v":405},{"$f":"IF(OR(K$12=0,$B61=0),0,IF(výkony!$D$8<0.7,IF(logic!$A$50=1,výkony!J62,výkony!W62),IF(logic!$A$50=1,výkony!AK62,výkony!AP62)))","v":553},{"$f":"IF(OR(L$12=0,$B61=0),0,IF(výkony!$D$8<0.7,IF(logic!$A$50=1,výkony!K62,výkony!X62),IF(logic!$A$50=1,výkony!AL62,výkony!AQ62)))","v":687},{"$f":"IF(OR(M$12=0,$B61=0),0,IF(výkony!$D$8<0.7,IF(logic!$A$50=1,výkony!L62,výkony!Y62),IF(logic!$A$50=1,výkony!AM62,výkony!AR62)))","v":848},{"$f":"C61","v":500},null,null,null,null,495,{"$f":"\"KRT-\"&IF(LEN(T$59)=3,\"0\"&T$59/10,T$59/10)&\"0\"&ROUND($S61/10,0)&\"-00-10\"","v":"KRT-070050-00-10"},"KRT-090050-00-10","KRT-122050-00-10","KRT-150050-00-10","KRT-182050-00-10",{"$f":"\"KRT-\"&IF(LEN(Y$59)=3,\"0\"&Y$59/10,Y$59/10)&\"0\"&ROUND($S61/10,0)&\"-00M10\"","v":"KRT-070050-00M10"},"KRT-090050-00M10","KRT-122050-00M10","KRT-150050-00M10","KRT-182050-00M10",495]
[null,{"$f":"IF(AND($K$5=logic!$I$4,$M$5=logic!$I$4),1,IF(AND(C62>=$K$5,C62<=$M$5),1,0))","v":1},{"$f":"IF(logic!$K$64=2,výkony!B63/logic!$M$64,výkony!B63)","v":600},{"$f":"IF(OR(D$12=0,$B62=0),0,IF(výkony!$D$8<0.7,IF(logic!$A$50=1,výkony!C63,výkony!P63),IF(logic!$A$50=1,výkony!AD63,výkony!AI63)))","v":370},{"$f":"IF(OR(E$12=0,$B62=0),0,IF(výkony!$D$8<0.7,IF(logic!$A$50=1,výkony!D63,výkony!Q63),IF(logic!$A$50=1,výkony!AE63,výkony!AJ63)))","v":475},{"$f":"IF(OR(F$12=0,$B62=0),0,IF(výkony!$D$8<0.7,IF(logic!$A$50=1,výkony!E63,výkony!R63),IF(logic!$A$50=1,výkony!AF63,výkony!AK63)))","v":650},{"$f":"IF(OR(G$12=0,$B62=0),0,IF(výkony!$D$8<0.7,IF(logic!$A$50=1,výkony!F63,výkony!S63),IF(logic!$A$50=1,výkony!AG63,výkony!AL63)))","v":808},{"$f":"IF(OR(H$12=0,$B62=0),0,IF(výkony!$D$8<0.7,IF(logic!$A$50=1,výkony!G63,výkony!T63),IF(logic!$A$50=1,výkony!AH63,výkony!AM63)))","v":996},{"$f":"IF(OR(I$12=0,$B62=0),0,IF(výkony!$D$8<0.7,IF(logic!$A$50=1,výkony!H63,výkony!U63),IF(logic!$A$50=1,výkony!AI63,výkony!AN63)))","v":370},{"$f":"IF(OR(J$12=0,$B62=0),0,IF(výkony!$D$8<0.7,IF(logic!$A$50=1,výkony!I63,výkony!V63),IF(logic!$A$50=1,výkony!AJ63,výkony!AO63)))","v":475},{"$f":"IF(OR(K$12=0,$B62=0),0,IF(výkony!$D$8<0.7,IF(logic!$A$50=1,výkony!J63,výkony!W63),IF(logic!$A$50=1,výkony!AK63,výkony!AP63)))","v":650},{"$f":"IF(OR(L$12=0,$B62=0),0,IF(výkony!$D$8<0.7,IF(logic!$A$50=1,výkony!K63,výkony!X63),IF(logic!$A$50=1,výkony!AL63,výkony!AQ63)))","v":808},{"$f":"IF(OR(M$12=0,$B62=0),0,IF(výkony!$D$8<0.7,IF(logic!$A$50=1,výkony!L63,výkony!Y63),IF(logic!$A$50=1,výkony!AM63,výkony!AR63)))","v":996},600,null,null,null,null,595,"KRT-070060-00-10","KRT-090060-00-10","KRT-122060-00-10","KRT-150060-00-10","KRT-182060-00-10","KRT-070060-00M10","KRT-090060-00M10","KRT-122060-00M10","KRT-150060-00M10","KRT-182060-00M10",595]
[null,{"$f":"IF(AND($K$5=logic!$I$4,$M$5=logic!$I$4),1,IF(AND(C63>=$K$5,C63<=$M$5),1,0))","v":1},{"$f":"IF(logic!$K$64=2,výkony!B64/logic!$M$64,výkony!B64)","v":750},{"$f":"IF(OR(D$12=0,$B63=0),0,IF(výkony!$D$8<0.7,IF(logic!$A$50=1,výkony!C64,výkony!P64),IF(logic!$A$50=1,výkony!AD64,výkony!AI64)))","v":450},{"$f":"IF(OR(E$12=0,$B63=0),0,IF(výkony!$D$8<0.7,IF(logic!$A$50=1,výkony!D64,výkony!Q64),IF(logic!$A$50=1,výkony!AE64,výkony!AJ64)))","v":579},{"$f":"IF(OR(F$12=0,$B63=0),0,IF(výkony!$D$8<0.7,IF(logic!$A$50=1,výkony!E64,výkony!R64),IF(logic!$A$50=1,výkony!AF64,výkony!AK64)))","v":791},{"$f":"IF(OR(G$12=0,$B63=0),0,IF(výkony!$D$8<0.7,IF(logic!$A$50=1,výkony!F64,výkony!S64),IF(logic!$A$50=1,výkony!AG64,výkony!AL64)))","v":984},{"$f":"IF(OR(H$12=0,$B63=0),0,IF(výkony!$D$8<0.7,IF(logic!$A$50=1,výkony!G64,výkony!T64),IF(logic!$A$50=1,výkony!AH64,výkony!AM64)))","v":1213},{"$f":"IF(OR(I$12=0,$B63=0),0,IF(výkony!$D$8<0.7,IF(logic!$A$50=1,výkony!H64,výkony!U64),IF(logic!$A$50=1,výkony!AI64,výkony!AN64)))","v":450},{"$f":"IF(OR(J$12=0,$B63=0),0,IF(výkony!$D$8<0.7,IF(logic!$A$50=1,výkony!I64,výkony!V64),IF(logic!$A$50=1,výkony!AJ64,výkony!AO64)))","v":579},{"$f":"IF(OR(K$12=0,$B63=0),0,IF(výkony!$D$8<0.7,IF(logic!$A$50=1,výkony!J64,výkony!W64),IF(logic!$A$50=1,výkony!AK64,výkony!AP64)))","v":791},{"$f":"IF(OR(L$12=0,$B63=0),0,IF(výkony!$D$8<0.7,IF(logic!$A$50=1,výkony!K64,výkony!X64),IF(logic!$A$50=1,výkony!AL64,výkony!AQ64)))","v":984},{"$f":"IF(OR(M$12=0,$B63=0),0,IF(výkony!$D$8<0.7,IF(logic!$A$50=1,výkony!L64,výkony!Y64),IF(logic!$A$50=1,výkony!AM64,výkony!AR64)))","v":1213},750,null,null,null,null,745,"KRT-070075-00-10","KRT-090075-00-10","KRT-122075-00-10","KRT-150075-00-10","KRT-182075-00-10","KRT-070075-00M10","KRT-090075-00M10","KRT-122075-00M10","KRT-150075-00M10","KRT-182075-00M10",745]
[]
[null,null,null,"KORALUX RONDO CLASSIC",null,null,null,null,"KORALUX RONDO CLASSIC - M",null,null,null,null,null,null,null,null,null,null,"KORALUX RONDO CLASSIC",null,null,null,null,"KORALUX RONDO CLASSIC - M"]
[null,null,{"$f":"logic!$L$4","v":"Długość"},{"$f":"logic!$K$4&\" H [\"&logic!$O$64&\"]\"","v":"Wysokość H [mm]"},null,null,null,null,{"$f":"logic!$K$4&\" H [\"&logic!$O$64&\"]\"","v":"Wysokość H [mm]"},null,null,null,null,{"$f":"logic!$L$4","v":"Długość"},null,null,null,null,{"$f":"logic!$L$4","v":"Długość"},{"$f":"logic!$K$4&\" H [mm]\"","v":"Wysokość H [mm]"},null,null,null,null,{"$f":"logic!$K$4&\" H [mm]\"","v":"Wysokość H [mm]"},null,null,null,null,{"$f":"logic!$L$4","v":"Długość"}]
[null,null,{"$f":"\"L [\"&logic!$O$64&\"]\"","v":"L [mm]"},{"$f":"IF(logic!$K$64=2,výkony!C68/logic!$M$64,výkony!C68)","v":700},{"$f":"IF(logic!$K$64=2,výkony!D68/logic!$M$64,výkony!D68)","v":900},{"$f":"IF(logic!$K$64=2,výkony!E68/logic!$M$64,výkony!E68)","v":1220},{"$f":"IF(logic!$K$64=2,výkony!F68/logic!$M$64,výkony!F68)","v":1500},{"$f":"IF(logic!$K$64=2,výkony!G68/logic!$M$64,výkony!G68)","v":1820},{"$f":"IF(logic!$K$64=2,výkony!H68/logic!$M$64,výkony!H68)","v":700},{"$f":"IF(logic!$K$64=2,výkony!I68/logic!$M$64,výkony!I68)","v":900},{"$f":"IF(logic!$K$64=2,výkony!J68/logic!$M$64,výkony!J68)","v":1220},{"$f":"IF(logic!$K$64=2,výkony!K68/logic!$M$64,výkony!K68)","v":1500},{"$f":"IF(logic!$K$64=2,výkony!L68/logic!$M$64,výkony!L68)","v":1820},{"$f":"\"L [\"&logic!$O$64&\"]\"","v":"L [mm]"},null,null,null,null,"L [mm]",700,900,1220,1500,1820,700,900,1220,1500,1820,"L [mm]"]
[null,{"$f":"IF(AND($K$5=logic!$I$4,$M$5=logic!$I$4),1,IF(AND(C68>=$K$5,C68<=$M$5),1,0))","v":1},{"$f":"IF(logic!$K$64=2,výkony!B69/logic!$M$64,výkony!B69)","v":450},{"$f":"IF(OR(D$12=0,$B68=0),0,IF(výkony!$D$8<0.7,IF(logic!$A$50=1,výkony!C69,výkony!P69),IF(logic!$A$50=1,výkony!AD69,výkony!AI69)))","v":255},{"$f":"IF(OR(E$12=0,$B68=0),0,IF(výkony!$D$8<0.7,IF(logic!$A$50=1,výkony!D69,výkony!Q69),IF(logic!$A$50=1,výkony!AE69,výkony!AJ69)))","v":333},{"$f":"IF(OR(F$12=0,$B68=0),0,IF(výkony!$D$8<0.7,IF(logic!$A$50=1,výkony!E69,výkony!R69),IF(logic!$A$50=1,výkony!AF69,výkony!AK69)))","v":462},{"$f":"IF(OR(G$12=0,$B68=0),0,IF(výkony!$D$8<0.7,IF(logic!$A$50=1,výkony!F69,výkony!S69),IF(logic!$A$50=1,výkony!AG69,výkony!AL69)))","v":581},{"$f":"IF(OR(H$12=0,$B68=0),0,IF(výkony!$D$8<0.7,IF(logic!$A$50=1,výkony!G69,výkony!T69),IF(logic!$A$50=1,výkony!AH69,výkony!AM69)))","v":725},{"$f":"IF(OR(I$12=0,$B68=0),0,IF(výkony!$D$8<0.7,IF(logic!$A$50=1,výkony!H69,výkony!U69),IF(logic!$A$50=1,výkony!AI69,výkony!AN69)))","v":255},{"$f":"IF(OR(J$12=0,$B68=0),0,IF(výkony!$D$8<0.7,IF(logic!$A$50=1,výkony!I69,výkony!V69),IF(logic!$A$50=1,výkony!AJ69,výkony!AO69)))","v":333},{"$f":"IF(OR(K$12=0,$B68=0),0,IF(výkony!$D$8<0.7,IF(logic!$A$50=1,výkony!J69,výkony!W69),IF(logic!$A$50=1,výkony!AK69,výkony!AP69)))","v":462},{"$f":"IF(OR(L$12=0,$B68=0),0,IF(výkony!$D$8<0.7,IF(logic!$A$50=1,výkony!K69,výkony!X69),IF(logic!$A$50=1,výkony!AL69,výkony!AQ69)))","v":581},{"$f":"IF(OR(M$12=0,$B68=0),0,IF(výkony!$D$8<0.7,IF(logic!$A$50=1,výkony!L69,výkony!Y69),IF(logic!$A$50=1,výkony!AM69,výkony!AR69)))","v":725},{"$f":"C68","v":450},null,null,null,null,445,{"$f":"\"KRC-\"&IF(LEN(T$67)=3,\"0\"&T$67/10,T$67/10)&\"0\"&ROUND($S68/10,0)&\"-00-10\"","v":"KRC-070045-00-10"},{"$f":"\"KRC-\"&IF(LEN(U$67)=3,\"0\"&U$67/10,U$67/10)&\"0\"&ROUND($S68/10,0)&\"-00-10\"","v":"KRC-090045-00-10"},"KRC-122045-00-10","KRC-150045-00-10","KRC-182045-00-10",{"$f":"\"KRC-\"&IF(LEN(Y$67)=3,\"0\"&Y$67/10,Y$67/10)&\"0\"&ROUND($S68/10,0)&\"-00M10\"","v":"KRC-070045-00M10"},{"$f":"\"KRC-\"&IF(LEN(Z$67)=3,\"0\"&Z$67/10,Z$67/10)&\"0\"&ROUND($S68/10,0)&\"-00M10\"","v":"KRC-090045-00M10"},"KRC-122045-00M10","KRC-150045-00M10","KRC-182045-00M10",445]
[null,1,{"$f":"IF(logic!$K$64=2,výkony!B70/logic!$M$64,výkony!B70)","v":500},{"$f":"IF(OR(D$12=0,$B69=0),0,IF(výkony!$D$8<0.7,IF(logic!$A$50=1,výkony!C70,výkony!P70),IF(logic!$A$50=1,výkony!AD70,výkony!AI70)))","v":280},{"$f":"IF(OR(E$12=0,$B69=0),0,IF(výkony!$D$8<0.7,IF(logic!$A$50=1,výkony!D70,výkony!Q70),IF(logic!$A$50=1,výkony!AE70,výkony!AJ70)))","v":365},{"$f":"IF(OR(F$12=0,$B69=0),0,IF(výkony!$D$8<0.7,IF(logic!$A$50=1,výkony!E70,výkony!R70),IF(logic!$A$50=1,výkony!AF70,výkony!AK70)))","v":507},{"$f":"IF(OR(G$12=0,$B69=0),0,IF(výkony!$D$8<0.7,IF(logic!$A$50=1,výkony!F70,výkony!S70),IF(logic!$A$50=1,výkony!AG70,výkony!AL70)))","v":638},{"$f":"IF(OR(H$12=0,$B69=0),0,IF(výkony!$D$8<0.7,IF(logic!$A$50=1,výkony!G70,výkony!T70),IF(logic!$A$50=1,výkony!AH70,výkony!AM70)))","v":795},{"$f":"IF(OR(I$12=0,$B69=0),0,IF(výkony!$D$8<0.7,IF(logic!$A$50=1,výkony!H70,výkony!U70),IF(logic!$A$50=1,výkony!AI70,výkony!AN70)))","v":280},{"$f":"IF(OR(J$12=0,$B69=0),0,IF(výkony!$D$8<0.7,IF(logic!$A$50=1,výkony!I70,výkony!V70),IF(logic!$A$50=1,výkony!AJ70,výkony!AO70)))","v":365},{"$f":"IF(OR(K$12=0,$B69=0),0,IF(výkony!$D$8<0.7,IF(logic!$A$50=1,výkony!J70,výkony!W70),IF(logic!$A$50=1,výkony!AK70,výkony!AP70)))","v":507},{"$f":"IF(OR(L$12=0,$B69=0),0,IF(výkony!$D$8<0.7,IF(logic!$A$50=1,výkony!K70,výkony!X70),IF(logic!$A$50=1,výkony!AL70,výkony!AQ70)))","v":638},{"$f":"IF(OR(M$12=0,$B69=0),0,IF(výkony!$D$8<0.7,IF(logic!$A$50=1,výkony!L70,výkony!Y70),IF(logic!$A$50=1,výkony!AM70,výkony!AR70)))","v":795},{"$f":"C69","v":500},null,null,null,null,495,{"$f":"\"KRC-\"&IF(LEN(T$67)=3,\"0\"&T$67/10,T$67/10)&\"0\"&ROUND($S69/10,0)&\"-00-10\"","v":"KRC-070050-00-10"},"KRC-090050-00-10","KRC-122050-00-10","KRC-150050-00-10","KRC-182050-00-10",{"$f":"\"KRC-\"&IF(LEN(Y$67)=3,\"0\"&Y$67/10,Y$67/10)&\"0\"&ROUND($S69/10,0)&\"-00M10\"","v":"KRC-070050-00M10"},"KRC-090050-00M10","KRC-122050-00M10","KRC-150050-00M10","KRC-182050-00M10",495]
[null,{"$f":"IF(AND($K$5=logic!$I$4,$M$5=logic!$I$4),1,IF(AND(C70>=$K$5,C70<=$M$5),1,0))","v":1},{"$f":"IF(logic!$K$64=2,výkony!B71/logic!$M$64,výkony!B71)","v":600},{"$f":"IF(OR(D$12=0,$B70=0),0,IF(výkony!$D$8<0.7,IF(logic!$A$50=1,výkony!C71,výkony!P71),IF(logic!$A$50=1,výkony!AD71,výkony!AI71)))","v":329},{"$f":"IF(OR(E$12=0,$B70=0),0,IF(výkony!$D$8<0.7,IF(logic!$A$50=1,výkony!D71,výkony!Q71),IF(logic!$A$50=1,výkony!AE71,výkony!AJ71)))","v":429},{"$f":"IF(OR(F$12=0,$B70=0),0,IF(výkony!$D$8<0.7,IF(logic!$A$50=1,výkony!E71,výkony!R71),IF(logic!$A$50=1,výkony!AF71,výkony!AK71)))","v":596},{"$f":"IF(OR(G$12=0,$B70=0),0,IF(výkony!$D$8<0.7,IF(logic!$A$50=1,výkony!F71,výkony!S71),IF(logic!$A$50=1,výkony!AG71,výkony!AL71)))","v":750},{"$f":"IF(OR(H$12=0,$B70=0),0,IF(výkony!$D$8<0.7,IF(logic!$A$50=1,výkony!G71,výkony!T71),IF(logic!$A$50=1,výkony!AH71,výkony!AM71)))","v":934},{"$f":"IF(OR(I$12=0,$B70=0),0,IF(výkony!$D$8<0.7,IF(logic!$A$50=1,výkony!H71,výkony!U71),IF(logic!$A$50=1,výkony!AI71,výkony!AN71)))","v":329},{"$f":"IF(OR(J$12=0,$B70=0),0,IF(výkony!$D$8<0.7,IF(logic!$A$50=1,výkony!I71,výkony!V71),IF(logic!$A$50=1,výkony!AJ71,výkony!AO71)))","v":429},{"$f":"IF(OR(K$12=0,$B70=0),0,IF(výkony!$D$8<0.7,IF(logic!$A$50=1,výkony!J71,výkony!W71),IF(logic!$A$50=1,výkony!AK71,výkony!AP71)))","v":596},{"$f":"IF(OR(L$12=0,$B70=0),0,IF(výkony!$D$8<0.7,IF(logic!$A$50=1,výkony!K71,výkony!X71),IF(logic!$A$50=1,výkony!AL71,výkony!AQ71)))","v":750},{"$f":"IF(OR(M$12=0,$B70=0),0,IF(výkony!$D$8<0.7,IF(logic!$A$50=1,výkony!L71,výkony!Y71),IF(logic!$A$50=1,výkony!AM71,výkony!AR71)))","v":934},600,null,null,null,null,595,"KRC-070060-00-10","KRC-090060-00-10","KRC-122060-00-10","KRC-150060-00-10","KRC-182060-00-10","KRC-070060-00M10","KRC-090060-00M10","KRC-122060-00M10","KRC-150060-00M10","KRC-182060-00M10",595]
[null,{"$f":"IF(AND($K$5=logic!$I$4,$M$5=logic!$I$4),1,IF(AND(C71>=$K$5,C71<=$M$5),1,0))","v":1},{"$f":"IF(logic!$K$64=2,výkony!B72/logic!$M$64,výkony!B72)","v":750},{"$f":"IF(OR(D$12=0,$B71=0),0,IF(výkony!$D$8<0.7,IF(logic!$A$50=1,výkony!C72,výkony!P72),IF(logic!$A$50=1,výkony!AD72,výkony!AI72)))","v":400},{"$f":"IF(OR(E$12=0,$B71=0),0,IF(výkony!$D$8<0.7,IF(logic!$A$50=1,výkony!D72,výkony!Q72),IF(logic!$A$50=1,výkony!AE72,výkony!AJ72)))","v":522},{"$f":"IF(OR(F$12=0,$B71=0),0,IF(výkony!$D$8<0.7,IF(logic!$A$50=1,výkony!E72,výkony!R72),IF(logic!$A$50=1,výkony!AF72,výkony!AK72)))","v":726},{"$f":"IF(OR(G$12=0,$B71=0),0,IF(výkony!$D$8<0.7,IF(logic!$A$50=1,výkony!F72,výkony!S72),IF(logic!$A$50=1,výkony!AG72,výkony!AL72)))","v":913},{"$f":"IF(OR(H$12=0,$B71=0),0,IF(výkony!$D$8<0.7,IF(logic!$A$50=1,výkony!G72,výkony!T72),IF(logic!$A$50=1,výkony!AH72,výkony!AM72)))","v":1138},{"$f":"IF(OR(I$12=0,$B71=0),0,IF(výkony!$D$8<0.7,IF(logic!$A$50=1,výkony!H72,výkony!U72),IF(logic!$A$50=1,výkony!AI72,výkony!AN72)))","v":400},{"$f":"IF(OR(J$12=0,$B71=0),0,IF(výkony!$D$8<0.7,IF(logic!$A$50=1,výkony!I72,výkony!V72),IF(logic!$A$50=1,výkony!AJ72,výkony!AO72)))","v":522},{"$f":"IF(OR(K$12=0,$B71=0),0,IF(výkony!$D$8<0.7,IF(logic!$A$50=1,výkony!J72,výkony!W72),IF(logic!$A$50=1,výkony!AK72,výkony!AP72)))","v":726},{"$f":"IF(OR(L$12=0,$B71=0),0,IF(výkony!$D$8<0.7,IF(logic!$A$50=1,výkony!K72,výkony!X72),IF(logic!$A$50=1,výkony!AL72,výkony!AQ72)))","v":913},{"$f":"IF(OR(M$12=0,$B71=0),0,IF(výkony!$D$8<0.7,IF(logic!$A$50=1,výkony!L72,výkony!Y72),IF(logic!$A$50=1,výkony!AM72,výkony!AR72)))","v":1138},750,null,null,null,null,745,"KRC-070075-00-10","KRC-090075-00-10","KRC-122075-00-10","KRC-150075-00-10","KRC-182075-00-10","KRC-070075-00M10","KRC-090075-00M10","KRC-122075-00M10","KRC-150075-00M10","KRC-182075-00M10",745]
[]
[null,null,null,"KORALUX RONDO EXCLUSIVE - M",null,null,null,null,null,null,null,null,null,null,null,null,null,null,null,"KORALUX LINEAR EXCLUSIVE - M",null,null,null,null,null,"KORALUX RONDO EXCLUSIVE - M"]
[null,null,{"$f":"logic!$L$4","v":"Długość"},{"$f":"logic!$K$4&\" H [\"&logic!$O$64&\"]\"","v":"Wysokość H [mm]"},null,null,null,null,null,null,null,null,null,null,null,null,null,null,{"$f":"logic!$L$4","v":"Długość"},{"$f":"logic!$K$4&\" H [mm]\"","v":"Wysokość H [mm]"},null,null,null,null,{"$f":"logic!$L$4","v":"Długość"},{"$f":"logic!$K$4&\" H [mm]\"","v":"Wysokość H [mm]"}]
[null,null,{"$f":"\"L [\"&logic!$O$64&\"]\"","v":"L [mm]"},{"$f":"IF(logic!$K$64=2,výkony!C76/logic!$M$64,výkony!C76)","v":900},{"$f":"IF(logic!$K$64=2,výkony!D76/logic!$M$64,výkony!D76)","v":1220},{"$f":"IF(logic!$K$64=2,výkony!E76/logic!$M$64,výkony!E76)","v":1500},{"$f":"IF(logic!$K$64=2,výkony!F76/logic!$M$64,výkony!F76)","v":1820},null,null,null,null,null,null,null,null,null,null,null,"L [mm]",900,1220,1500,1820,null,"L [mm]",900,1220,1500,1820]
[null,{"$f":"IF(AND($K$5=logic!$I$4,$M$5=logic!$I$4),1,IF(AND(C46>=$K$5,C46<=$M$5),1,0))","v":1},{"$f":"IF(logic!$K$64=2,výkony!B77/logic!$M$64,výkony!B77)","v":450},{"$f":"IF(OR(D$12=0,$B76=0),0,IF(výkony!$D$8<0.7,IF(logic!$A$50=1,výkony!C77,výkony!P77),IF(logic!$A$50=1,výkony!AD77,výkony!AI77)))","v":249},{"$f":"IF(OR(E$12=0,$B76=0),0,IF(výkony!$D$8<0.7,IF(logic!$A$50=1,výkony!D77,výkony!Q77),IF(logic!$A$50=1,výkony!AE77,výkony!AJ77)))","v":338},{"$f":"IF(OR(F$12=0,$B76=0),0,IF(výkony!$D$8<0.7,IF(logic!$A$50=1,výkony!E77,výkony!R77),IF(logic!$A$50=1,výkony!AF77,výkony!AK77)))","v":419},{"$f":"IF(OR(G$12=0,$B76=0),0,IF(výkony!$D$8<0.7,IF(logic!$A$50=1,výkony!F77,výkony!S77),IF(logic!$A$50=1,výkony!AG77,výkony!AL77)))","v":516},null,null,null,null,null,null,null,null,null,null,null,445,{"$f":"\"KLX-\"&IF(LEN(T$75)=3,\"0\"&T$75/10,T$75/10)&\"0\"&ROUND($S76/10,0)&\"-00M27\"","v":"KLX-090045-00M27"},{"$f":"\"KLX-\"&IF(LEN(U$75)=3,\"0\"&U$75/10,U$75/10)&\"0\"&ROUND($S76/10,0)&\"-00M27\"","v":"KLX-122045-00M27"},"KLX-150045-00M27","KLX-182045-00M27",null,450,{"$f":"\"KRX-\"&IF(LEN(Z$75)=3,\"0\"&Z$75/10,Z$75/10)&\"0\"&ROUND($S76/10,0)&\"-00M27\"","v":"KRX-090045-00M27"},{"$f":"\"KRX-\"&IF(LEN(AA$75)=3,\"0\"&AA$75/10,AA$75/10)&\"0\"&ROUND($S76/10,0)&\"-00M27\"","v":"KRX-122045-00M27"},"KRX-150045-00M27","KRX-182045-00M27"]
[null,{"$f":"IF(AND($K$5=logic!$I$4,$M$5=logic!$I$4),1,IF(AND(C47>=$K$5,C47<=$M$5),1,0))","v":1},{"$f":"IF(logic!$K$64=2,výkony!B78/logic!$M$64,výkony!B78)","v":600},{"$f":"IF(OR(D$12=0,$B77=0),0,IF(výkony!$D$8<0.7,IF(logic!$A$50=1,výkony!C78,výkony!P78),IF(logic!$A$50=1,výkony!AD78,výkony!AI78)))","v":319},{"$f":"IF(OR(E$12=0,$B77=0),0,IF(výkony!$D$8<0.7,IF(logic!$A$50=1,výkony!D78,výkony!Q78),IF(logic!$A$50=1,výkony!AE78,výkony!AJ78)))","v":433},{"$f":"IF(OR(F$12=0,$B77=0),0,IF(výkony!$D$8<0.7,IF(logic!$A$50=1,výkony!E78,výkony!R78),IF(logic!$A$50=1,výkony!AF78,výkony!AK78)))","v":537},{"$f":"IF(OR(G$12=0,$B77=0),0,IF(výkony!$D$8<0.7,IF(logic!$A$50=1,výkony!F78,výkony!S78),IF(logic!$A$50=1,výkony!AG78,výkony!AL78)))","v":662},null,null,null,null,null,null,null,null,null,null,null,595,{"$f":"\"KLX-\"&IF(LEN(T$75)=3,\"0\"&T$75/10,T$75/10)&\"0\"&ROUND($S77/10,0)&\"-00M27\"","v":"KLX-090060-00M27"},"KLX-122060-00M27","KLX-150060-00M27","KLX-182060-00M27",null,600,{"$f":"\"KRX-\"&IF(LEN(Z$75)=3,\"0\"&Z$75/10,Z$75/10)&\"0\"&ROUND($S77/10,0)&\"-00M27\"","v":"KRX-090060-00M27"},"KRX-122060-00M27","KRX-150060-00M27","KRX-182060-00M27"]
[null,{"$f":"IF(AND($K$5=logic!$I$4,$M$5=logic!$I$4),1,IF(AND(C48>=$K$5,C48<=$M$5),1,0))","v":1},{"$f":"IF(logic!$K$64=2,výkony!B79/logic!$M$64,výkony!B79)","v":750},{"$f":"IF(OR(D$12=0,$B78=0),0,IF(výkony!$D$8<0.7,IF(logic!$A$50=1,výkony!C79,výkony!P79),IF(logic!$A$50=1,výkony!AD79,výkony!AI79)))","v":387},{"$f":"IF(OR(E$12=0,$B78=0),0,IF(výkony!$D$8<0.7,IF(logic!$A$50=1,výkony!D79,výkony!Q79),IF(logic!$A$50=1,výkony!AE79,výkony!AJ79)))","v":526},{"$f":"IF(OR(F$12=0,$B78=0),0,IF(výkony!$D$8<0.7,IF(logic!$A$50=1,výkony!E79,výkony!R79),IF(logic!$A$50=1,výkony!AF79,výkony!AK79)))","v":652},{"$f":"IF(OR(G$12=0,$B78=0),0,IF(výkony!$D$8<0.7,IF(logic!$A$50=1,výkony!F79,výkony!S79),IF(logic!$A$50=1,výkony!AG79,výkony!AL79)))","v":802},null,null,null,null,null,null,null,null,null,null,null,745,"KLX-090075-00M27","KLX-122075-00M27","KLX-150075-00M27","KLX-182075-00M27",null,750,"KRX-090075-00M27","KRX-122075-00M27","KRX-150075-00M27","KRX-182075-00M27"]

{"sheet":"Databáze","index":1,"n_rows":6,"n_cols":11,"rows_kept":6,"cut":false,"hidden":true,"merged":[]}
[{"$f":"logic!AB24","v":"Identyfikacja:"}]
[]
[]
[]
[]
[{"$f":"logic!Q24","v":"Num"},{"$f":"logic!R24","v":"Model"},{"$f":"logic!S24","v":"Numer zamówienia"},{"$f":"logic!U24","v":"Wysokość [mm] [mm]"},{"$f":"logic!V24","v":"Długość [mm] [mm]"},{"$f":"logic!W24","v":"t1"},{"$f":"logic!X24","v":"t2"},{"$f":"logic!Y24","v":"ti"},{"$f":"logic!Z24&\" \"&logic!$E$45","v":"Wydajność cieplna [W]"},{"$f":"logic!U4","v":"Sposób podłączenia"},{"$f":"logic!AA24","v":"Notatka"}]

{"sheet":"výkony","index":2,"n_rows":79,"n_cols":57,"rows_kept":79,"cut":false,"hidden":true,"merged":[[24,69,25,69],[2,18,4,18],[2,19,4,19],[2,20,4,20],[3,58,5,58],[4,52,5,52],[4,53,5,53],[4,54,5,54],[4,55,5,55],[4,56,5,56],[6,42,7,43],[6,44,7,44],[3,57,5,57],[4,41,5,41],[4,29,6,29],[4,30,6,30],[3,14,4,14],[6,12,7,12],[6,13,7,13],[6,14,7,14],[6,16,7,16],[6,17,7,17],[22,68,23,68],[23,61,23,63],[24,60,25,60],[24,61,25,61],[24,62,25,62],[24,64,25,64],[24,65,25,65],[24,66,25,66],[24,67,25,68],[22,64,23,64],[22,65,23,65],[22,66,23,66],[22,67,23,67],[6,40,7,40],[6,41,7,41],[5,49,5,51],[6,35,7,35],[6,36,7,36],[6,37,7,37],[6,39,7,39],[4,40,5,40],[5,36,5,38],[4,39,5,39],[6,18,7,18],[6,19,7,20],[6,21,7,21],[4,42,5,42],[4,43,5,43],[4,31,6,31],[5,25,6,25]]}
[]
[null,null,320,null,1.2363,null,null,null,null,"2) LOGARITMICKÝ teplotní rozdíl"]
[null,null,{"$f":"logic!P4","v":"Temperatura:"},null,null,null,null,null,null,null,null,null,null,null,{"$f":"C5","v":75},"-",{"$f":"D5","v":65},null,"=",{"$f":"(O3-Q3)/(LN((P4-R4)/(P5-R5)))","v":49.83288654563971},"K",null,null,null,null,null,null,null,null,null,null,null,"1) ARITMETICKÝ teplotní rozdíl"]
[null,null,"t 1","t 2","t i"," D T",null,{"$f":"logic!Y4","v":"Unité de chaleur:"},null,null,null,null,null,null,"ln",{"$f":"C5","v":75},"-",{"$f":"E5","v":20},null,null,null,null,"LOGARITMICKÝ ROZDÍL TEPLOT  Δtln,N",null,null,null,null,null,null,null,null,null,null,null,null,null,null,null,null,null,null,null,null,null,null,null,null,"ARITMETICKÝ ROZDÍL TEPLOT ΔtN"]
[null,null,{"$f":"IF(logic!$K$64=1,KORADO!C4,výkony!C6)","v":75},{"$f":"IF(logic!$K$64=1,KORADO!D4,výkony!D6)","v":65},{"$f":"IF(logic!$K$64=1,KORADO!E4,výkony!E6)","v":20},{"$f":"(C5+D5)/2-E5","v":50},null,{"$f":"logic!C45","v":"W"},{"$f":"logic!D45","v":1},null,null,null,null,null,null,{"$f":"D5","v":65},"-",{"$f":"E5","v":20},null,null,null,null,null,null,null,75,"-",65,null,"=",{"$f":"(Z5-AB5)/(LN((AA6-AC6)/(AA7-AC7)))","v":49.83288654563971},null,null,null,null,null,{"$f":"C5","v":75},"+",{"$f":"D5","v":65},"-",{"$f":"E5","v":20},"=",{"$f":"(AK5+AM5)/AK6-AO5","v":50},"K",null,null,null,null,null,75,"+",65,"-",20,"=",{"$f":"(AX5+AZ5)/AX6-BB5","v":50},"K"]
[null,null,{"$f":"ROUND((t_1-32)/1.8,2)","v":23.89},{"$f":"ROUND((t_2-32)/1.8,2)","v":18.329999999999998},{"$f":"ROUND((t_i-32)/1.8,2)","v":-6.67},{"$f":"(C6+D6)/2-E6","v":27.78},null,null,null,null,null,null,null,null,null,null,null,null,null,null,null,null,null,null,null,"ln",75,"-",20,null,null,null,null,null,null,null,2,null,null,null,null,null,null,null,null,null,null,null,null,2]
[null,null,null,null,null,null,null,null,null,null,null,null,{"$f":"C2","v":320},"*","(",{"$f":"T3","v":49.83288654563971},")",{"$f":"E2","v":1.2363},"=",{"$f":"M7*POWER(P7/P8,R7)","v":320},null,"W",null,null,null,null,65,"-",20,null,null,null,null,null,null,{"$f":"U3","v":"K"},{"$f":"C2","v":320},"(",{"$f":"AQ5","v":50},")",{"$f":"E2","v":1.2363},"=",{"$f":"AK7*POWER(AM7/AM8,AO7)","v":320},null,"W"]
[null,null,"C =",{"$f":"(D5-E5)/(C5-E5)","v":0.81818181818181823},null,{"$f":"(D5-E5)/(C5-E5)","v":0.81818181818181823},null,null,null,null,null,null,null,null,null,{"$f":"AE5","v":49.83288654563971},null,null,null,null,null,null,null,null,null,null,null,null,null,null,null,null,null,null,null,null,null,null,50]
[]
[null,"LOGARITMICKÝ VÝPOČET",null,null,null,null,null,null,null,null,null,null,null,null,null,null,null,null,null,null,null,null,null,null,null,null,null,null,"ARITMETICKÝ VÝPOČET"]
[]
[]
[null,null,"VÝKONY PRO ZAPOJENÍ ZDOLA DOLŮ",null,null,null,null,null,null,null,null,null,null,null,"VÝKONY PRO ÚHLOPŘÍČNÉ ZAPOJENÍ",null,null,null,null,null,null,null,null,null,null,null,null,null,null,"VÝKONY PRO ZAPOJENÍ ZDOLA DOLŮ",null,null,null,null,null,null,null,null,null,null,null,"VÝKONY PRO ÚHLOPŘÍČNÉ ZAPOJENÍ"]
[null,null,"KORALUX LINEAR MAX",null,null,null,null,"KORALUX LINEAR MAX - M",null,null,null,null,null,null,null,"KORALUX LINEAR MAX",null,null,null,null,"KORALUX LINEAR MAX - M",null,null,null,null,null,null,null,null,"KORALUX LINEAR MAX",null,null,null,null,"KORALUX LINEAR MAX - M",null,null,null,null,null,null,null,"KORALUX LINEAR MAX",null,null,null,null,"KORALUX LINEAR MAX - M"]
[null,"Délka L","Výška H [mm]",null,null,null,null,"Výška H [mm]",null,null,null,null,"Délka L",null,"Délka L","Výška H [mm]",null,null,null,null,"Výška H [mm]",null,null,null,null,"Délka L",null,null,"Délka L","Výška H [mm]",null,null,null,null,"Výška H [mm]",null,null,null,null,"Délka L",null,"Délka L","Výška H [mm]",null,null,null,null,"Výška H [mm]",null,null,null,null,"Délka L"]
[null,"[mm]",700,900,1220,1500,1820,700,900,1220,1500,1820,"[mm]",null,"[mm]",700,900,1220,1500,1820,700,900,1220,1500,1820,"[mm]",null,null,"[mm]",700,900,1220,1500,1820,700,900,1220,1500,1820,"[mm]",null,"[mm]",700,900,1220,1500,1820,700,900,1220,1500,1820,"[mm]"]
[null,450,{"$f":"ROUND((((($C$5-$D$5)/(LN(($C$5-$E$5)/($D$5-$E$5))))/49.8328865456397)^vstupy!C22)*vstupy!C15*$I$5,0)","v":320},{"$f":"ROUND((((($C$5-$D$5)/(LN(($C$5-$E$5)/($D$5-$E$5))))/49.8328865456397)^vstupy!D$22)*vstupy!D15*$I$5,0)","v":411},{"$f":"ROUND((((($C$5-$D$5)/(LN(($C$5-$E$5)/($D$5-$E$5))))/49.8328865456397)^vstupy!E$22)*vstupy!E15*$I$5,0)","v":557},{"$f":"ROUND((((($C$5-$D$5)/(LN(($C$5-$E$5)/($D$5-$E$5))))/49.8328865456397)^vstupy!F$22)*vstupy!F15*$I$5,0)","v":686},{"$f":"ROUND((((($C$5-$D$5)/(LN(($C$5-$E$5)/($D$5-$E$5))))/49.8328865456397)^vstupy!G$22)*vstupy!G15*$I$5,0)","v":833},{"$f":"ROUND((((($C$5-$D$5)/(LN(($C$5-$E$5)/($D$5-$E$5))))/49.8328865456397)^vstupy!H$22)*vstupy!H15*$I$5,0)","v":320},{"$f":"ROUND((((($C$5-$D$5)/(LN(($C$5-$E$5)/($D$5-$E$5))))/49.8328865456397)^vstupy!I$22)*vstupy!I15*$I$5,0)","v":411},{"$f":"ROUND((((($C$5-$D$5)/(LN(($C$5-$E$5)/($D$5-$E$5))))/49.8328865456397)^vstupy!J$22)*vstupy!J15*$I$5,0)","v":557},{"$f":"ROUND((((($C$5-$D$5)/(LN(($C$5-$E$5)/($D$5-$E$5))))/49.8328865456397)^vstupy!K$22)*vstupy!K15*$I$5,0)","v":686},{"$f":"ROUND((((($C$5-$D$5)/(LN(($C$5-$E$5)/($D$5-$E$5))))/49.8328865456397)^vstupy!L$22)*vstupy!L15*$I$5,0)","v":833},450,null,450,{"$f":"ROUND((((($C$5-$D$5)/(LN(($C$5-$E$5)/($D$5-$E$5))))/49.8328865456397)^vstupy!P$22)*vstupy!P15*$I$5,0)","v":341},{"$f":"ROUND((((($C$5-$D$5)/(LN(($C$5-$E$5)/($D$5-$E$5))))/49.8328865456397)^vstupy!Q$22)*vstupy!Q15*$I$5,0)","v":436},{"$f":"ROUND((((($C$5-$D$5)/(LN(($C$5-$E$5)/($D$5-$E$5))))/49.8328865456397)^vstupy!R$22)*vstupy!R15*$I$5,0)","v":592},{"$f":"ROUND((((($C$5-$D$5)/(LN(($C$5-$E$5)/($D$5-$E$5))))/49.8328865456397)^vstupy!S$22)*vstupy!S15*$I$5,0)","v":735},{"$f":"ROUND((((($C$5-$D$5)/(LN(($C$5-$E$5)/($D$5-$E$5))))/49.8328865456397)^vstupy!T$22)*vstupy!T15*$I$5,0)","v":906},null,null,null,null,null,450,null,null,450,{"$f":"ROUND((vstupy!C15*POWER($F$5/50,vstupy!C22))*$I$5,0)","v":320},{"$f":"ROUND((vstupy!D15*POWER($F$5/50,vstupy!D22))*$I$5,0)","v":411},{"$f":"ROUND((vstupy!E15*POWER($F$5/50,vstupy!E22))*$I$5,0)","v":557},{"$f":"ROUND((vstupy!F15*POWER($F$5/50,vstupy!F22))*$I$5,0)","v":686},{"$f":"ROUND((vstupy!G15*POWER($F$5/50,vstupy!G22))*$I$5,0)","v":833},{"$f":"ROUND((vstupy!H15*POWER($F$5/50,vstupy!H22))*$I$5,0)","v":320},{"$f":"ROUND((vstupy!I15*POWER($F$5/50,vstupy!I22))*$I$5,0)","v":411},{"$f":"ROUND((vstupy!J15*POWER($F$5/50,vstupy!J22))*$I$5,0)","v":557},{"$f":"ROUND((vstupy!K15*POWER($F$5/50,vstupy!K22))*$I$5,0)","v":686},{"$f":"ROUND((vstupy!L15*POWER($F$5/50,vstupy!L22))*$I$5,0)","v":833},450,null,450,{"$f":"ROUND((vstupy!P15*POWER($F$5/50,vstupy!P22))*$I$5,0)","v":341},{"$f":"ROUND((vstupy!Q15*POWER($F$5/50,vstupy!Q22))*$I$5,0)","v":436},{"$f":"ROUND((vstupy!R15*POWER($F$5/50,vstupy!R22))*$I$5,0)","v":592},{"$f":"ROUND((vstupy!S15*POWER($F$5/50,vstupy!S22))*$I$5,0)","v":735},{"$f":"ROUND((vstupy!T15*POWER($F$5/50,vstupy!T22))*$I$5,0)","v":906},null,null,null,null,null,450]
[null,600,{"$f":"ROUND((((($C$5-$D$5)/(LN(($C$5-$E$5)/($D$5-$E$5))))/49.8328865456397)^vstupy!C23)*vstupy!C16*$I$5,0)","v":422},{"$f":"ROUND((((($C$5-$D$5)/(LN(($C$5-$E$5)/($D$5-$E$5))))/49.8328865456397)^vstupy!D23)*vstupy!D16*$I$5,0)","v":543},{"$f":"ROUND((((($C$5-$D$5)/(LN(($C$5-$E$5)/($D$5-$E$5))))/49.8328865456397)^vstupy!E23)*vstupy!E16*$I$5,0)","v":736},{"$f":"ROUND((((($C$5-$D$5)/(LN(($C$5-$E$5)/($D$5-$E$5))))/49.8328865456397)^vstupy!F23)*vstupy!F16*$I$5,0)","v":906},{"$f":"ROUND((((($C$5-$D$5)/(LN(($C$5-$E$5)/($D$5-$E$5))))/49.8328865456397)^vstupy!G23)*vstupy!G16*$I$5,0)","v":1101},{"$f":"ROUND((((($C$5-$D$5)/(LN(($C$5-$E$5)/($D$5-$E$5))))/49.8328865456397)^vstupy!H23)*vstupy!H16*$I$5,0)","v":422},{"$f":"ROUND((((($C$5-$D$5)/(LN(($C$5-$E$5)/($D$5-$E$5))))/49.8328865456397)^vstupy!I23)*vstupy!I16*$I$5,0)","v":543},{"$f":"ROUND((((($C$5-$D$5)/(LN(($C$5-$E$5)/($D$5-$E$5))))/49.8328865456397)^vstupy!J23)*vstupy!J16*$I$5,0)","v":736},{"$f":"ROUND((((($C$5-$D$5)/(LN(($C$5-$E$5)/($D$5-$E$5))))/49.8328865456397)^vstupy!K23)*vstupy!K16*$I$5,0)","v":906},{"$f":"ROUND((((($C$5-$D$5)/(LN(($C$5-$E$5)/($D$5-$E$5))))/49.8328865456397)^vstupy!L23)*vstupy!L16*$I$5,0)","v":1101},600,null,600,{"$f":"ROUND((((($C$5-$D$5)/(LN(($C$5-$E$5)/($D$5-$E$5))))/49.8328865456397)^vstupy!P23)*vstupy!P16*$I$5,0)","v":454},{"$f":"ROUND((((($C$5-$D$5)/(LN(($C$5-$E$5)/($D$5-$E$5))))/49.8328865456397)^vstupy!Q23)*vstupy!Q16*$I$5,0)","v":580},{"$f":"ROUND((((($C$5-$D$5)/(LN(($C$5-$E$5)/($D$5-$E$5))))/49.8328865456397)^vstupy!R23)*vstupy!R16*$I$5,0)","v":789},{"$f":"ROUND((((($C$5-$D$5)/(LN(($C$5-$E$5)/($D$5-$E$5))))/49.8328865456397)^vstupy!S23)*vstupy!S16*$I$5,0)","v":979},{"$f":"ROUND((((($C$5-$D$5)/(LN(($C$5-$E$5)/($D$5-$E$5))))/49.8328865456397)^vstupy!T23)*vstupy!T16*$I$5,0)","v":1206},null,null,null,null,null,600,null,null,600,{"$f":"ROUND((vstupy!C16*POWER($F$5/50,vstupy!C23))*$I$5,0)","v":422},{"$f":"ROUND((vstupy!D16*POWER($F$5/50,vstupy!D23))*$I$5,0)","v":543},{"$f":"ROUND((vstupy!E16*POWER($F$5/50,vstupy!E23))*$I$5,0)","v":736},{"$f":"ROUND((vstupy!F16*POWER($F$5/50,vstupy!F23))*$I$5,0)","v":906},{"$f":"ROUND((vstupy!G16*POWER($F$5/50,vstupy!G23))*$I$5,0)","v":1101},{"$f":"ROUND((vstupy!H16*POWER($F$5/50,vstupy!H23))*$I$5,0)","v":422},{"$f":"ROUND((vstupy!I16*POWER($F$5/50,vstupy!I23))*$I$5,0)","v":543},{"$f":"ROUND((vstupy!J16*POWER($F$5/50,vstupy!J23))*$I$5,0)","v":736},{"$f":"ROUND((vstupy!K16*POWER($F$5/50,vstupy!K23))*$I$5,0)","v":906},{"$f":"ROUND((vstupy!L16*POWER($F$5/50,vstupy!L23))*$I$5,0)","v":1101},600,null,600,{"$f":"ROUND((vstupy!P16*POWER($F$5/50,vstupy!P23))*$I$5,0)","v":454},{"$f":"ROUND((vstupy!Q16*POWER($F$5/50,vstupy!Q23))*$I$5,0)","v":580},{"$f":"ROUND((vstupy!R16*POWER($F$5/50,vstupy!R23))*$I$5,0)","v":789},{"$f":"ROUND((vstupy!S16*POWER($F$5/50,vstupy!S23))*$I$5,0)","v":979},{"$f":"ROUND((vstupy!T16*POWER($F$5/50,vstupy!T23))*$I$5,0)","v":1206},null,null,null,null,null,600]
[null,750,{"$f":"ROUND((((($C$5-$D$5)/(LN(($C$5-$E$5)/($D$5-$E$5))))/49.8328865456397)^vstupy!C24)*vstupy!C17*$I$5,0)","v":524},{"$f":"ROUND((((($C$5-$D$5)/(LN(($C$5-$E$5)/($D$5-$E$5))))/49.8328865456397)^vstupy!D24)*vstupy!D17*$I$5,0)","v":673},{"$f":"ROUND((((($C$5-$D$5)/(LN(($C$5-$E$5)/($D$5-$E$5))))/49.8328865456397)^vstupy!E24)*vstupy!E17*$I$5,0)","v":913},{"$f":"ROUND((((($C$5-$D$5)/(LN(($C$5-$E$5)/($D$5-$E$5))))/49.8328865456397)^vstupy!F24)*vstupy!F17*$I$5,0)","v":1124},{"$f":"ROUND((((($C$5-$D$5)/(LN(($C$5-$E$5)/($D$5-$E$5))))/49.8328865456397)^vstupy!G24)*vstupy!G17*$I$5,0)","v":1367},{"$f":"ROUND((((($C$5-$D$5)/(LN(($C$5-$E$5)/($D$5-$E$5))))/49.8328865456397)^vstupy!H24)*vstupy!H17*$I$5,0)","v":524},{"$f":"ROUND((((($C$5-$D$5)/(LN(($C$5-$E$5)/($D$5-$E$5))))/49.8328865456397)^vstupy!I24)*vstupy!I17*$I$5,0)","v":673},{"$f":"ROUND((((($C$5-$D$5)/(LN(($C$5-$E$5)/($D$5-$E$5))))/49.8328865456397)^vstupy!J24)*vstupy!J17*$I$5,0)","v":913},{"$f":"ROUND((((($C$5-$D$5)/(LN(($C$5-$E$5)/($D$5-$E$5))))/49.8328865456397)^vstupy!K24)*vstupy!K17*$I$5,0)","v":1124},{"$f":"ROUND((((($C$5-$D$5)/(LN(($C$5-$E$5)/($D$5-$E$5))))/49.8328865456397)^vstupy!L24)*vstupy!L17*$I$5,0)","v":1367},750,null,750,{"$f":"ROUND((((($C$5-$D$5)/(LN(($C$5-$E$5)/($D$5-$E$5))))/49.8328865456397)^vstupy!P24)*vstupy!P17*$I$5,0)","v":567},{"$f":"ROUND((((($C$5-$D$5)/(LN(($C$5-$E$5)/($D$5-$E$5))))/49.8328865456397)^vstupy!Q24)*vstupy!Q17*$I$5,0)","v":725},{"$f":"ROUND((((($C$5-$D$5)/(LN(($C$5-$E$5)/($D$5-$E$5))))/49.8328865456397)^vstupy!R24)*vstupy!R17*$I$5,0)","v":985},{"$f":"ROUND((((($C$5-$D$5)/(LN(($C$5-$E$5)/($D$5-$E$5))))/49.8328865456397)^vstupy!S24)*vstupy!S17*$I$5,0)","v":1222},{"$f":"ROUND((((($C$5-$D$5)/(LN(($C$5-$E$5)/($D$5-$E$5))))/49.8328865456397)^vstupy!T24)*vstupy!T17*$I$5,0)","v":1507},null,null,null,null,null,750,null,null,750,{"$f":"ROUND((vstupy!C17*POWER($F$5/50,vstupy!C24))*$I$5,0)","v":524},{"$f":"ROUND((vstupy!D17*POWER($F$5/50,vstupy!D24))*$I$5,0)","v":673},{"$f":"ROUND((vstupy!E17*POWER($F$5/50,vstupy!E24))*$I$5,0)","v":913},{"$f":"ROUND((vstupy!F17*POWER($F$5/50,vstupy!F24))*$I$5,0)","v":1124},{"$f":"ROUND((vstupy!G17*POWER($F$5/50,vstupy!G24))*$I$5,0)","v":1367},{"$f":"ROUND((vstupy!H17*POWER($F$5/50,vstupy!H24))*$I$5,0)","v":524},{"$f":"ROUND((vstupy!I17*POWER($F$5/50,vstupy!I24))*$I$5,0)","v":673},{"$f":"ROUND((vstupy!J17*POWER($F$5/50,vstupy!J24))*$I$5,0)","v":913},{"$f":"ROUND((vstupy!K17*POWER($F$5/50,vstupy!K24))*$I$5,0)","v":1124},{"$f":"ROUND((vstupy!L17*POWER($F$5/50,vstupy!L24))*$I$5,0)","v":1367},750,null,750,{"$f":"ROUND((vstupy!P17*POWER($F$5/50,vstupy!P24))*$I$5,0)","v":567},{"$f":"ROUND((vstupy!Q17*POWER($F$5/50,vstupy!Q24))*$I$5,0)","v":725},{"$f":"ROUND((vstupy!R17*POWER($F$5/50,vstupy!R24))*$I$5,0)","v":985},{"$f":"ROUND((vstupy!S17*POWER($F$5/50,vstupy!S24))*$I$5,0)","v":1222},{"$f":"ROUND((vstupy!T17*POWER($F$5/50,vstupy!T24))*$I$5,0)","v":1507},null,null,null,null,null,750]
[]
[null,null,"KORALUX LINEAR COMFORT",null,null,null,null,"KORALUX LINEAR COMFORT - M",null,null,null,null,null,null,null,"KORALUX LINEAR COMFORT",null,null,null,null,"KORALUX LINEAR COMFORT - M",null,null,null,null,null,null,null,null,"KORALUX LINEAR COMFORT",null,null,null,null,"KORALUX LINEAR COMFORT - M",null,null,null,null,null,null,null,"KORALUX LINEAR COMFORT",null,null,null,null,"KORALUX LINEAR COMFORT - M"]
[null,"Délka L","Výška H [mm]",null,null,null,null,"Výška H [mm]",null,null,null,null,"Délka L",null,"Délka L","Výška H [mm]",null,null,null,null,"Výška H [mm]",null,null,null,null,"Délka L",null,null,"Délka L","Výška H [mm]",null,null,null,null,"Výška H [mm]",null,null,null,null,"Délka L",null,"Délka L","Výška H [mm]",null,null,null,null,"Výška H [mm]",null,null,null,null,"Délka L"]
[null,"[mm]",700,900,1220,1500,1820,700,900,1220,1500,1820,"[mm]",null,"[mm]",700,900,1220,1500,1820,700,900,1220,1500,1820,"[mm]",null,null,"[mm]",700,900,1220,1500,1820,700,900,1220,1500,1820,"[mm]",null,"[mm]",700,900,1220,1500,1820,700,900,1220,1500,1820,"[mm]"]
[null,450,{"$f":"ROUND((((($C$5-$D$5)/(LN(($C$5-$E$5)/($D$5-$E$5))))/49.8328865456397)^vstupy!C37)*vstupy!C29*$I$5,0)","v":287},{"$f":"ROUND((((($C$5-$D$5)/(LN(($C$5-$E$5)/($D$5-$E$5))))/49.8328865456397)^vstupy!D37)*vstupy!D29*$I$5,0)","v":369},{"$f":"ROUND((((($C$5-$D$5)/(LN(($C$5-$E$5)/($D$5-$E$5))))/49.8328865456397)^vstupy!E37)*vstupy!E29*$I$5,0)","v":504},{"$f":"ROUND((((($C$5-$D$5)/(LN(($C$5-$E$5)/($D$5-$E$5))))/49.8328865456397)^vstupy!F37)*vstupy!F29*$I$5,0)","v":626},{"$f":"ROUND((((($C$5-$D$5)/(LN(($C$5-$E$5)/($D$5-$E$5))))/49.8328865456397)^vstupy!G37)*vstupy!G29*$I$5,0)","v":772},{"$f":"ROUND((((($C$5-$D$5)/(LN(($C$5-$E$5)/($D$5-$E$5))))/49.8328865456397)^vstupy!H37)*vstupy!H29*$I$5,0)","v":287},{"$f":"ROUND((((($C$5-$D$5)/(LN(($C$5-$E$5)/($D$5-$E$5))))/49.8328865456397)^vstupy!I37)*vstupy!I29*$I$5,0)","v":369},{"$f":"ROUND((((($C$5-$D$5)/(LN(($C$5-$E$5)/($D$5-$E$5))))/49.8328865456397)^vstupy!J37)*vstupy!J29*$I$5,0)","v":504},{"$f":"ROUND((((($C$5-$D$5)/(LN(($C$5-$E$5)/($D$5-$E$5))))/49.8328865456397)^vstupy!K37)*vstupy!K29*$I$5,0)","v":626},{"$f":"ROUND((((($C$5-$D$5)/(LN(($C$5-$E$5)/($D$5-$E$5))))/49.8328865456397)^vstupy!L37)*vstupy!L29*$I$5,0)","v":772},450,null,450,{"$f":"ROUND((((($C$5-$D$5)/(LN(($C$5-$E$5)/($D$5-$E$5))))/49.8328865456397)^vstupy!P37)*vstupy!P29*$I$5,0)","v":312},{"$f":"ROUND((((($C$5-$D$5)/(LN(($C$5-$E$5)/($D$5-$E$5))))/49.8328865456397)^vstupy!Q37)*vstupy!Q29*$I$5,0)","v":402},{"$f":"ROUND((((($C$5-$D$5)/(LN(($C$5-$E$5)/($D$5-$E$5))))/49.8328865456397)^vstupy!R37)*vstupy!R29*$I$5,0)","v":549},{"$f":"ROUND((((($C$5-$D$5)/(LN(($C$5-$E$5)/($D$5-$E$5))))/49.8328865456397)^vstupy!S37)*vstupy!S29*$I$5,0)","v":682},{"$f":"ROUND((((($C$5-$D$5)/(LN(($C$5-$E$5)/($D$5-$E$5))))/49.8328865456397)^vstupy!T37)*vstupy!T29*$I$5,0)","v":841},null,null,null,null,null,450,null,null,450,{"$f":"ROUND((vstupy!C29*POWER($F$5/50,vstupy!C37))*$I$5,0)","v":287},{"$f":"ROUND((vstupy!D29*POWER($F$5/50,vstupy!D37))*$I$5,0)","v":369},{"$f":"ROUND((vstupy!E29*POWER($F$5/50,vstupy!E37))*$I$5,0)","v":504},{"$f":"ROUND((vstupy!F29*POWER($F$5/50,vstupy!F37))*$I$5,0)","v":626},{"$f":"ROUND((vstupy!G29*POWER($F$5/50,vstupy!G37))*$I$5,0)","v":772},{"$f":"ROUND((vstupy!H29*POWER($F$5/50,vstupy!H37))*$I$5,0)","v":287},{"$f":"ROUND((vstupy!I29*POWER($F$5/50,vstupy!I37))*$I$5,0)","v":369},{"$f":"ROUND((vstupy!J29*POWER($F$5/50,vstupy!J37))*$I$5,0)","v":504},{"$f":"ROUND((vstupy!K29*POWER($F$5/50,vstupy!K37))*$I$5,0)","v":626},{"$f":"ROUND((vstupy!L29*POWER($F$5/50,vstupy!L37))*$I$5,0)","v":772},450,null,450,{"$f":"ROUND((vstupy!P29*POWER($F$5/50,vstupy!P37))*$I$5,0)","v":312},{"$f":"ROUND((vstupy!Q29*POWER($F$5/50,vstupy!Q37))*$I$5,0)","v":402},{"$f":"ROUND((vstupy!R29*POWER($F$5/50,vstupy!R37))*$I$5,0)","v":549},{"$f":"ROUND((vstupy!S29*POWER($F$5/50,vstupy!S37))*$I$5,0)","v":682},{"$f":"ROUND((vstupy!T29*POWER($F$5/50,vstupy!T37))*$I$5,0)","v":841},null,null,null,null,null,450]
[null,500,{"$f":"ROUND((((($C$5-$D$5)/(LN(($C$5-$E$5)/($D$5-$E$5))))/49.8328865456397)^vstupy!C38)*vstupy!C30*$I$5,0)","v":315},{"$f":"ROUND((((($C$5-$D$5)/(LN(($C$5-$E$5)/($D$5-$E$5))))/49.8328865456397)^vstupy!D38)*vstupy!D30*$I$5,0)","v":405},{"$f":"ROUND((((($C$5-$D$5)/(LN(($C$5-$E$5)/($D$5-$E$5))))/49.8328865456397)^vstupy!E38)*vstupy!E30*$I$5,0)","v":553},{"$f":"ROUND((((($C$5-$D$5)/(LN(($C$5-$E$5)/($D$5-$E$5))))/49.8328865456397)^vstupy!F38)*vstupy!F30*$I$5,0)","v":687},{"$f":"ROUND((((($C$5-$D$5)/(LN(($C$5-$E$5)/($D$5-$E$5))))/49.8328865456397)^vstupy!G38)*vstupy!G30*$I$5,0)","v":848},{"$f":"ROUND((((($C$5-$D$5)/(LN(($C$5-$E$5)/($D$5-$E$5))))/49.8328865456397)^vstupy!H38)*vstupy!H30*$I$5,0)","v":315},{"$f":"ROUND((((($C$5-$D$5)/(LN(($C$5-$E$5)/($D$5-$E$5))))/49.8328865456397)^vstupy!I38)*vstupy!I30*$I$5,0)","v":405},{"$f":"ROUND((((($C$5-$D$5)/(LN(($C$5-$E$5)/($D$5-$E$5))))/49.8328865456397)^vstupy!J38)*vstupy!J30*$I$5,0)","v":553},{"$f":"ROUND((((($C$5-$D$5)/(LN(($C$5-$E$5)/($D$5-$E$5))))/49.8328865456397)^vstupy!K38)*vstupy!K30*$I$5,0)","v":687},{"$f":"ROUND((((($C$5-$D$5)/(LN(($C$5-$E$5)/($D$5-$E$5))))/49.8328865456397)^vstupy!L38)*vstupy!L30*$I$5,0)","v":848},500,null,500,{"$f":"ROUND((((($C$5-$D$5)/(LN(($C$5-$E$5)/($D$5-$E$5))))/49.8328865456397)^vstupy!P38)*vstupy!P30*$I$5,0)","v":342},{"$f":"ROUND((((($C$5-$D$5)/(LN(($C$5-$E$5)/($D$5-$E$5))))/49.8328865456397)^vstupy!Q38)*vstupy!Q30*$I$5,0)","v":440},{"$f":"ROUND((((($C$5-$D$5)/(LN(($C$5-$E$5)/($D$5-$E$5))))/49.8328865456397)^vstupy!R38)*vstupy!R30*$I$5,0)","v":601},{"$f":"ROUND((((($C$5-$D$5)/(LN(($C$5-$E$5)/($D$5-$E$5))))/49.8328865456397)^vstupy!S38)*vstupy!S30*$I$5,0)","v":747},{"$f":"ROUND((((($C$5-$D$5)/(LN(($C$5-$E$5)/($D$5-$E$5))))/49.8328865456397)^vstupy!T38)*vstupy!T30*$I$5,0)","v":921},null,null,null,null,null,null,null,null,500,{"$f":"ROUND((vstupy!C30*POWER($F$5/50,vstupy!C38))*$I$5,0)","v":315},{"$f":"ROUND((vstupy!D30*POWER($F$5/50,vstupy!D38))*$I$5,0)","v":405},{"$f":"ROUND((vstupy!E30*POWER($F$5/50,vstupy!E38))*$I$5,0)","v":553},{"$f":"ROUND((vstupy!F30*POWER($F$5/50,vstupy!F38))*$I$5,0)","v":687},{"$f":"ROUND((vstupy!G30*POWER($F$5/50,vstupy!G38))*$I$5,0)","v":848},{"$f":"ROUND((vstupy!H30*POWER($F$5/50,vstupy!H38))*$I$5,0)","v":315},{"$f":"ROUND((vstupy!I30*POWER($F$5/50,vstupy!I38))*$I$5,0)","v":405},{"$f":"ROUND((vstupy!J30*POWER($F$5/50,vstupy!J38))*$I$5,0)","v":553},{"$f":"ROUND((vstupy!K30*POWER($F$5/50,vstupy!K38))*$I$5,0)","v":687},{"$f":"ROUND((vstupy!L30*POWER($F$5/50,vstupy!L38))*$I$5,0)","v":848},500,null,500,{"$f":"ROUND((vstupy!P30*POWER($F$5/50,vstupy!P38))*$I$5,0)","v":342},{"$f":"ROUND((vstupy!Q30*POWER($F$5/50,vstupy!Q38))*$I$5,0)","v":440},{"$f":"ROUND((vstupy!R30*POWER($F$5/50,vstupy!R38))*$I$5,0)","v":601},{"$f":"ROUND((vstupy!S30*POWER($F$5/50,vstupy!S38))*$I$5,0)","v":747},{"$f":"ROUND((vstupy!T30*POWER($F$5/50,vstupy!T38))*$I$5,0)","v":921},null,null,null,null,null,500]
[null,600,{"$f":"ROUND((((($C$5-$D$5)/(LN(($C$5-$E$5)/($D$5-$E$5))))/49.8328865456397)^vstupy!C39)*vstupy!C31*$I$5,0)","v":370},{"$f":"ROUND((((($C$5-$D$5)/(LN(($C$5-$E$5)/($D$5-$E$5))))/49.8328865456397)^vstupy!D39)*vstupy!D31*$I$5,0)","v":475},{"$f":"ROUND((((($C$5-$D$5)/(LN(($C$5-$E$5)/($D$5-$E$5))))/49.8328865456397)^vstupy!E39)*vstupy!E31*$I$5,0)","v":650},{"$f":"ROUND((((($C$5-$D$5)/(LN(($C$5-$E$5)/($D$5-$E$5))))/49.8328865456397)^vstupy!F39)*vstupy!F31*$I$5,0)","v":808},{"$f":"ROUND((((($C$5-$D$5)/(LN(($C$5-$E$5)/($D$5-$E$5))))/49.8328865456397)^vstupy!G39)*vstupy!G31*$I$5,0)","v":996},{"$f":"ROUND((((($C$5-$D$5)/(LN(($C$5-$E$5)/($D$5-$E$5))))/49.8328865456397)^vstupy!H39)*vstupy!H31*$I$5,0)","v":370},{"$f":"ROUND((((($C$5-$D$5)/(LN(($C$5-$E$5)/($D$5-$E$5))))/49.8328865456397)^vstupy!I39)*vstupy!I31*$I$5,0)","v":475},{"$f":"ROUND((((($C$5-$D$5)/(LN(($C$5-$E$5)/($D$5-$E$5))))/49.8328865456397)^vstupy!J39)*vstupy!J31*$I$5,0)","v":650},{"$f":"ROUND((((($C$5-$D$5)/(LN(($C$5-$E$5)/($D$5-$E$5))))/49.8328865456397)^vstupy!K39)*vstupy!K31*$I$5,0)","v":808},{"$f":"ROUND((((($C$5-$D$5)/(LN(($C$5-$E$5)/($D$5-$E$5))))/49.8328865456397)^vstupy!L39)*vstupy!L31*$I$5,0)","v":996},600,null,600,{"$f":"ROUND((((($C$5-$D$5)/(LN(($C$5-$E$5)/($D$5-$E$5))))/49.8328865456397)^vstupy!P39)*vstupy!P31*$I$5,0)","v":400},{"$f":"ROUND((((($C$5-$D$5)/(LN(($C$5-$E$5)/($D$5-$E$5))))/49.8328865456397)^vstupy!Q39)*vstupy!Q31*$I$5,0)","v":515},{"$f":"ROUND((((($C$5-$D$5)/(LN(($C$5-$E$5)/($D$5-$E$5))))/49.8328865456397)^vstupy!R39)*vstupy!R31*$I$5,0)","v":703},{"$f":"ROUND((((($C$5-$D$5)/(LN(($C$5-$E$5)/($D$5-$E$5))))/49.8328865456397)^vstupy!S39)*vstupy!S31*$I$5,0)","v":874},{"$f":"ROUND((((($C$5-$D$5)/(LN(($C$5-$E$5)/($D$5-$E$5))))/49.8328865456397)^vstupy!T39)*vstupy!T31*$I$5,0)","v":1078},null,null,null,null,null,600,null,null,600,{"$f":"ROUND((vstupy!C31*POWER($F$5/50,vstupy!C39))*$I$5,0)","v":370},{"$f":"ROUND((vstupy!D31*POWER($F$5/50,vstupy!D39))*$I$5,0)","v":475},{"$f":"ROUND((vstupy!E31*POWER($F$5/50,vstupy!E39))*$I$5,0)","v":650},{"$f":"ROUND((vstupy!F31*POWER($F$5/50,vstupy!F39))*$I$5,0)","v":808},{"$f":"ROUND((vstupy!G31*POWER($F$5/50,vstupy!G39))*$I$5,0)","v":996},{"$f":"ROUND((vstupy!H31*POWER($F$5/50,vstupy!H39))*$I$5,0)","v":370},{"$f":"ROUND((vstupy!I31*POWER($F$5/50,vstupy!I39))*$I$5,0)","v":475},{"$f":"ROUND((vstupy!J31*POWER($F$5/50,vstupy!J39))*$I$5,0)","v":650},{"$f":"ROUND((vstupy!K31*POWER($F$5/50,vstupy!K39))*$I$5,0)","v":808},{"$f":"ROUND((vstupy!L31*POWER($F$5/50,vstupy!L39))*$I$5,0)","v":996},600,null,600,{"$f":"ROUND((vstupy!P31*POWER($F$5/50,vstupy!P39))*$I$5,0)","v":400},{"$f":"ROUND((vstupy!Q31*POWER($F$5/50,vstupy!Q39))*$I$5,0)","v":515},{"$f":"ROUND((vstupy!R31*POWER($F$5/50,vstupy!R39))*$I$5,0)","v":703},{"$f":"ROUND((vstupy!S31*POWER($F$5/50,vstupy!S39))*$I$5,0)","v":874},{"$f":"ROUND((vstupy!T31*POWER($F$5/50,vstupy!T39))*$I$5,0)","v":1078},null,null,null,null,null,600]
[null,750,{"$f":"ROUND((((($C$5-$D$5)/(LN(($C$5-$E$5)/($D$5-$E$5))))/49.8328865456397)^vstupy!C40)*vstupy!C32*$I$5,0)","v":450},{"$f":"ROUND((((($C$5-$D$5)/(LN(($C$5-$E$5)/($D$5-$E$5))))/49.8328865456397)^vstupy!D40)*vstupy!D32*$I$5,0)","v":579},{"$f":"ROUND((((($C$5-$D$5)/(LN(($C$5-$E$5)/($D$5-$E$5))))/49.8328865456397)^vstupy!E40)*vstupy!E32*$I$5,0)","v":791},{"$f":"ROUND((((($C$5-$D$5)/(LN(($C$5-$E$5)/($D$5-$E$5))))/49.8328865456397)^vstupy!F40)*vstupy!F32*$I$5,0)","v":984},{"$f":"ROUND((((($C$5-$D$5)/(LN(($C$5-$E$5)/($D$5-$E$5))))/49.8328865456397)^vstupy!G40)*vstupy!G32*$I$5,0)","v":1213},{"$f":"ROUND((((($C$5-$D$5)/(LN(($C$5-$E$5)/($D$5-$E$5))))/49.8328865456397)^vstupy!H40)*vstupy!H32*$I$5,0)","v":450},{"$f":"ROUND((((($C$5-$D$5)/(LN(($C$5-$E$5)/($D$5-$E$5))))/49.8328865456397)^vstupy!I40)*vstupy!I32*$I$5,0)","v":579},{"$f":"ROUND((((($C$5-$D$5)/(LN(($C$5-$E$5)/($D$5-$E$5))))/49.8328865456397)^vstupy!J40)*vstupy!J32*$I$5,0)","v":791},{"$f":"ROUND((((($C$5-$D$5)/(LN(($C$5-$E$5)/($D$5-$E$5))))/49.8328865456397)^vstupy!K40)*vstupy!K32*$I$5,0)","v":984},{"$f":"ROUND((((($C$5-$D$5)/(LN(($C$5-$E$5)/($D$5-$E$5))))/49.8328865456397)^vstupy!L40)*vstupy!L32*$I$5,0)","v":1213},750,null,750,{"$f":"ROUND((((($C$5-$D$5)/(LN(($C$5-$E$5)/($D$5-$E$5))))/49.8328865456397)^vstupy!P40)*vstupy!P32*$I$5,0)","v":485},{"$f":"ROUND((((($C$5-$D$5)/(LN(($C$5-$E$5)/($D$5-$E$5))))/49.8328865456397)^vstupy!Q40)*vstupy!Q32*$I$5,0)","v":624},{"$f":"ROUND((((($C$5-$D$5)/(LN(($C$5-$E$5)/($D$5-$E$5))))/49.8328865456397)^vstupy!R40)*vstupy!R32*$I$5,0)","v":852},{"$f":"ROUND((((($C$5-$D$5)/(LN(($C$5-$E$5)/($D$5-$E$5))))/49.8328865456397)^vstupy!S40)*vstupy!S32*$I$5,0)","v":1060},{"$f":"ROUND((((($C$5-$D$5)/(LN(($C$5-$E$5)/($D$5-$E$5))))/49.8328865456397)^vstupy!T40)*vstupy!T32*$I$5,0)","v":1307},null,null,null,null,null,750,null,null,750,{"$f":"ROUND((vstupy!C32*POWER($F$5/50,vstupy!C40))*$I$5,0)","v":450},{"$f":"ROUND((vstupy!D32*POWER($F$5/50,vstupy!D40))*$I$5,0)","v":579},{"$f":"ROUND((vstupy!E32*POWER($F$5/50,vstupy!E40))*$I$5,0)","v":791},{"$f":"ROUND((vstupy!F32*POWER($F$5/50,vstupy!F40))*$I$5,0)","v":984},{"$f":"ROUND((vstupy!G32*POWER($F$5/50,vstupy!G40))*$I$5,0)","v":1213},{"$f":"ROUND((vstupy!H32*POWER($F$5/50,vstupy!H40))*$I$5,0)","v":450},{"$f":"ROUND((vstupy!I32*POWER($F$5/50,vstupy!I40))*$I$5,0)","v":579},{"$f":"ROUND((vstupy!J32*POWER($F$5/50,vstupy!J40))*$I$5,0)","v":791},{"$f":"ROUND((vstupy!K32*POWER($F$5/50,vstupy!K40))*$I$5,0)","v":984},{"$f":"ROUND((vstupy!L32*POWER($F$5/50,vstupy!L40))*$I$5,0)","v":1213},750,null,750,{"$f":"ROUND((vstupy!P32*POWER($F$5/50,vstupy!P40))*$I$5,0)","v":485},{"$f":"ROUND((vstupy!Q32*POWER($F$5/50,vstupy!Q40))*$I$5,0)","v":624},{"$f":"ROUND((vstupy!R32*POWER($F$5/50,vstupy!R40))*$I$5,0)","v":852},{"$f":"ROUND((vstupy!S32*POWER($F$5/50,vstupy!S40))*$I$5,0)","v":1060},{"$f":"ROUND((vstupy!T32*POWER($F$5/50,vstupy!T40))*$I$5,0)","v":1307},null,null,null,null,null,750]
[]
[null,null,"KORALUX LINEAR CLASSIC",null,null,null,null,"KORALUX LINEAR CLASSIC - M",null,null,null,null,null,null,null,"KORALUX LINEAR CLASSIC",null,null,null,null,"KORALUX LINEAR CLASSIC - M",null,null,null,null,null,null,null,null,"KORALUX LINEAR CLASSIC",null,null,null,null,"KORALUX LINEAR CLASSIC - M",null,null,null,null,null,null,null,"KORALUX LINEAR CLASSIC",null,null,null,null,"KORALUX LINEAR CLASSIC - M"]
[null,"Délka L","Výška H [mm]",null,null,null,null,"Výška H [mm]",null,null,null,null,"Délka L",null,"Délka L","Výška H [mm]",null,null,null,null,"Výška H [mm]",null,null,null,null,"Délka L",null,null,"Délka L","Výška H [mm]",null,null,null,null,"Výška H [mm]",null,null,null,null,"Délka L",null,"Délka L","Výška H [mm]",null,null,null,null,"Výška H [mm]",null,null,null,null,"Délka L"]
[null,"[mm]",700,900,1220,1500,1820,700,900,1220,1500,1820,"[mm]",null,"[mm]",700,900,1220,1500,1820,700,900,1220,1500,1820,"[mm]",null,null,"[mm]",700,900,1220,1500,1820,700,900,1220,1500,1820,"[mm]",null,"[mm]",700,900,1220,1500,1820,700,900,1220,1500,1820,"[mm]"]
[null,450,{"$f":"ROUND((((($C$5-$D$5)/(LN(($C$5-$E$5)/($D$5-$E$5))))/49.8328865456397)^vstupy!C53)*vstupy!C45*$I$5,0)","v":255},{"$f":"ROUND((((($C$5-$D$5)/(LN(($C$5-$E$5)/($D$5-$E$5))))/49.8328865456397)^vstupy!D53)*vstupy!D45*$I$5,0)","v":333},{"$f":"ROUND((((($C$5-$D$5)/(LN(($C$5-$E$5)/($D$5-$E$5))))/49.8328865456397)^vstupy!E53)*vstupy!E45*$I$5,0)","v":462},{"$f":"ROUND((((($C$5-$D$5)/(LN(($C$5-$E$5)/($D$5-$E$5))))/49.8328865456397)^vstupy!F53)*vstupy!F45*$I$5,0)","v":581},{"$f":"ROUND((((($C$5-$D$5)/(LN(($C$5-$E$5)/($D$5-$E$5))))/49.8328865456397)^vstupy!G53)*vstupy!G45*$I$5,0)","v":725},{"$f":"ROUND((((($C$5-$D$5)/(LN(($C$5-$E$5)/($D$5-$E$5))))/49.8328865456397)^vstupy!H53)*vstupy!H45*$I$5,0)","v":255},{"$f":"ROUND((((($C$5-$D$5)/(LN(($C$5-$E$5)/($D$5-$E$5))))/49.8328865456397)^vstupy!I53)*vstupy!I45*$I$5,0)","v":333},{"$f":"ROUND((((($C$5-$D$5)/(LN(($C$5-$E$5)/($D$5-$E$5))))/49.8328865456397)^vstupy!J53)*vstupy!J45*$I$5,0)","v":462},{"$f":"ROUND((((($C$5-$D$5)/(LN(($C$5-$E$5)/($D$5-$E$5))))/49.8328865456397)^vstupy!K53)*vstupy!K45*$I$5,0)","v":581},{"$f":"ROUND((((($C$5-$D$5)/(LN(($C$5-$E$5)/($D$5-$E$5))))/49.8328865456397)^vstupy!L53)*vstupy!L45*$I$5,0)","v":725},450,null,450,{"$f":"ROUND((((($C$5-$D$5)/(LN(($C$5-$E$5)/($D$5-$E$5))))/49.8328865456397)^vstupy!P53)*vstupy!P45*$I$5,0)","v":291},{"$f":"ROUND((((($C$5-$D$5)/(LN(($C$5-$E$5)/($D$5-$E$5))))/49.8328865456397)^vstupy!Q53)*vstupy!Q45*$I$5,0)","v":378},{"$f":"ROUND((((($C$5-$D$5)/(LN(($C$5-$E$5)/($D$5-$E$5))))/49.8328865456397)^vstupy!R53)*vstupy!R45*$I$5,0)","v":519},{"$f":"ROUND((((($C$5-$D$5)/(LN(($C$5-$E$5)/($D$5-$E$5))))/49.8328865456397)^vstupy!S53)*vstupy!S45*$I$5,0)","v":643},{"$f":"ROUND((((($C$5-$D$5)/(LN(($C$5-$E$5)/($D$5-$E$5))))/49.8328865456397)^vstupy!T53)*vstupy!T45*$I$5,0)","v":786},null,null,null,null,null,450,null,null,450,{"$f":"ROUND((vstupy!C45*POWER($F$5/50,vstupy!C53))*$I$5,0)","v":255},{"$f":"ROUND((vstupy!D45*POWER($F$5/50,vstupy!D53))*$I$5,0)","v":333},{"$f":"ROUND((vstupy!E45*POWER($F$5/50,vstupy!E53))*$I$5,0)","v":462},{"$f":"ROUND((vstupy!F45*POWER($F$5/50,vstupy!F53))*$I$5,0)","v":581},{"$f":"ROUND((vstupy!G45*POWER($F$5/50,vstupy!G53))*$I$5,0)","v":725},{"$f":"ROUND((vstupy!H45*POWER($F$5/50,vstupy!H53))*$I$5,0)","v":255},{"$f":"ROUND((vstupy!I45*POWER($F$5/50,vstupy!I53))*$I$5,0)","v":333},{"$f":"ROUND((vstupy!J45*POWER($F$5/50,vstupy!J53))*$I$5,0)","v":462},{"$f":"ROUND((vstupy!K45*POWER($F$5/50,vstupy!K53))*$I$5,0)","v":581},{"$f":"ROUND((vstupy!L45*POWER($F$5/50,vstupy!L53))*$I$5,0)","v":725},450,null,450,{"$f":"ROUND((vstupy!P45*POWER($F$5/50,vstupy!P53))*$I$5,0)","v":291},{"$f":"ROUND((vstupy!Q45*POWER($F$5/50,vstupy!Q53))*$I$5,0)","v":378},{"$f":"ROUND((vstupy!R45*POWER($F$5/50,vstupy!R53))*$I$5,0)","v":519},{"$f":"ROUND((vstupy!S45*POWER($F$5/50,vstupy!S53))*$I$5,0)","v":643},{"$f":"ROUND((vstupy!T45*POWER($F$5/50,vstupy!T53))*$I$5,0)","v":786},null,null,null,null,null,450]
[null,500,{"$f":"ROUND((((($C$5-$D$5)/(LN(($C$5-$E$5)/($D$5-$E$5))))/49.8328865456397)^vstupy!C54)*vstupy!C46*$I$5,0)","v":280},{"$f":"ROUND((((($C$5-$D$5)/(LN(($C$5-$E$5)/($D$5-$E$5))))/49.8328865456397)^vstupy!D54)*vstupy!D46*$I$5,0)","v":365},{"$f":"ROUND((((($C$5-$D$5)/(LN(($C$5-$E$5)/($D$5-$E$5))))/49.8328865456397)^vstupy!E54)*vstupy!E46*$I$5,0)","v":507},{"$f":"ROUND((((($C$5-$D$5)/(LN(($C$5-$E$5)/($D$5-$E$5))))/49.8328865456397)^vstupy!F54)*vstupy!F46*$I$5,0)","v":638},{"$f":"ROUND((((($C$5-$D$5)/(LN(($C$5-$E$5)/($D$5-$E$5))))/49.8328865456397)^vstupy!G54)*vstupy!G46*$I$5,0)","v":795},{"$f":"ROUND((((($C$5-$D$5)/(LN(($C$5-$E$5)/($D$5-$E$5))))/49.8328865456397)^vstupy!H54)*vstupy!H46*$I$5,0)","v":280},{"$f":"ROUND((((($C$5-$D$5)/(LN(($C$5-$E$5)/($D$5-$E$5))))/49.8328865456397)^vstupy!I54)*vstupy!I46*$I$5,0)","v":365},{"$f":"ROUND((((($C$5-$D$5)/(LN(($C$5-$E$5)/($D$5-$E$5))))/49.8328865456397)^vstupy!J54)*vstupy!J46*$I$5,0)","v":507},{"$f":"ROUND((((($C$5-$D$5)/(LN(($C$5-$E$5)/($D$5-$E$5))))/49.8328865456397)^vstupy!K54)*vstupy!K46*$I$5,0)","v":638},{"$f":"ROUND((((($C$5-$D$5)/(LN(($C$5-$E$5)/($D$5-$E$5))))/49.8328865456397)^vstupy!L54)*vstupy!L46*$I$5,0)","v":795},500,null,500,{"$f":"ROUND((((($C$5-$D$5)/(LN(($C$5-$E$5)/($D$5-$E$5))))/49.8328865456397)^vstupy!P54)*vstupy!P46*$I$5,0)","v":318},{"$f":"ROUND((((($C$5-$D$5)/(LN(($C$5-$E$5)/($D$5-$E$5))))/49.8328865456397)^vstupy!Q54)*vstupy!Q46*$I$5,0)","v":413},{"$f":"ROUND((((($C$5-$D$5)/(LN(($C$5-$E$5)/($D$5-$E$5))))/49.8328865456397)^vstupy!R54)*vstupy!R46*$I$5,0)","v":567},{"$f":"ROUND((((($C$5-$D$5)/(LN(($C$5-$E$5)/($D$5-$E$5))))/49.8328865456397)^vstupy!S54)*vstupy!S46*$I$5,0)","v":703},{"$f":"ROUND((((($C$5-$D$5)/(LN(($C$5-$E$5)/($D$5-$E$5))))/49.8328865456397)^vstupy!T54)*vstupy!T46*$I$5,0)","v":859},null,null,null,null,null,500,null,null,500,{"$f":"ROUND((vstupy!C46*POWER($F$5/50,vstupy!C54))*$I$5,0)","v":280},{"$f":"ROUND((vstupy!D46*POWER($F$5/50,vstupy!D54))*$I$5,0)","v":365},{"$f":"ROUND((vstupy!E46*POWER($F$5/50,vstupy!E54))*$I$5,0)","v":507},{"$f":"ROUND((vstupy!F46*POWER($F$5/50,vstupy!F54))*$I$5,0)","v":638},{"$f":"ROUND((vstupy!G46*POWER($F$5/50,vstupy!G54))*$I$5,0)","v":795},{"$f":"ROUND((vstupy!H46*POWER($F$5/50,vstupy!H54))*$I$5,0)","v":280},{"$f":"ROUND((vstupy!I46*POWER($F$5/50,vstupy!I54))*$I$5,0)","v":365},{"$f":"ROUND((vstupy!J46*POWER($F$5/50,vstupy!J54))*$I$5,0)","v":507},{"$f":"ROUND((vstupy!K46*POWER($F$5/50,vstupy!K54))*$I$5,0)","v":638},{"$f":"ROUND((vstupy!L46*POWER($F$5/50,vstupy!L54))*$I$5,0)","v":795},500,null,500,{"$f":"ROUND((vstupy!P46*POWER($F$5/50,vstupy!P54))*$I$5,0)","v":318},{"$f":"ROUND((vstupy!Q46*POWER($F$5/50,vstupy!Q54))*$I$5,0)","v":413},{"$f":"ROUND((vstupy!R46*POWER($F$5/50,vstupy!R54))*$I$5,0)","v":567},{"$f":"ROUND((vstupy!S46*POWER($F$5/50,vstupy!S54))*$I$5,0)","v":703},{"$f":"ROUND((vstupy!T46*POWER($F$5/50,vstupy!T54))*$I$5,0)","v":859},null,null,null,null,null,500]
[null,600,{"$f":"ROUND((((($C$5-$D$5)/(LN(($C$5-$E$5)/($D$5-$E$5))))/49.8328865456397)^vstupy!C55)*vstupy!C47*$I$5,0)","v":329},{"$f":"ROUND((((($C$5-$D$5)/(LN(($C$5-$E$5)/($D$5-$E$5))))/49.8328865456397)^vstupy!D55)*vstupy!D47*$I$5,0)","v":429},{"$f":"ROUND((((($C$5-$D$5)/(LN(($C$5-$E$5)/($D$5-$E$5))))/49.8328865456397)^vstupy!E55)*vstupy!E47*$I$5,0)","v":596},{"$f":"ROUND((((($C$5-$D$5)/(LN(($C$5-$E$5)/($D$5-$E$5))))/49.8328865456397)^vstupy!F55)*vstupy!F47*$I$5,0)","v":750},{"$f":"ROUND((((($C$5-$D$5)/(LN(($C$5-$E$5)/($D$5-$E$5))))/49.8328865456397)^vstupy!G55)*vstupy!G47*$I$5,0)","v":934},{"$f":"ROUND((((($C$5-$D$5)/(LN(($C$5-$E$5)/($D$5-$E$5))))/49.8328865456397)^vstupy!H55)*vstupy!H47*$I$5,0)","v":329},{"$f":"ROUND((((($C$5-$D$5)/(LN(($C$5-$E$5)/($D$5-$E$5))))/49.8328865456397)^vstupy!I55)*vstupy!I47*$I$5,0)","v":429},{"$f":"ROUND((((($C$5-$D$5)/(LN(($C$5-$E$5)/($D$5-$E$5))))/49.8328865456397)^vstupy!J55)*vstupy!J47*$I$5,0)","v":596},{"$f":"ROUND((((($C$5-$D$5)/(LN(($C$5-$E$5)/($D$5-$E$5))))/49.8328865456397)^vstupy!K55)*vstupy!K47*$I$5,0)","v":750},{"$f":"ROUND((((($C$5-$D$5)/(LN(($C$5-$E$5)/($D$5-$E$5))))/49.8328865456397)^vstupy!L55)*vstupy!L47*$I$5,0)","v":934},600,null,600,{"$f":"ROUND((((($C$5-$D$5)/(LN(($C$5-$E$5)/($D$5-$E$5))))/49.8328865456397)^vstupy!P55)*vstupy!P47*$I$5,0)","v":372},{"$f":"ROUND((((($C$5-$D$5)/(LN(($C$5-$E$5)/($D$5-$E$5))))/49.8328865456397)^vstupy!Q55)*vstupy!Q47*$I$5,0)","v":482},{"$f":"ROUND((((($C$5-$D$5)/(LN(($C$5-$E$5)/($D$5-$E$5))))/49.8328865456397)^vstupy!R55)*vstupy!R47*$I$5,0)","v":662},{"$f":"ROUND((((($C$5-$D$5)/(LN(($C$5-$E$5)/($D$5-$E$5))))/49.8328865456397)^vstupy!S55)*vstupy!S47*$I$5,0)","v":820},{"$f":"ROUND((((($C$5-$D$5)/(LN(($C$5-$E$5)/($D$5-$E$5))))/49.8328865456397)^vstupy!T55)*vstupy!T47*$I$5,0)","v":1003},null,null,null,null,null,600,null,null,600,{"$f":"ROUND((vstupy!C47*POWER($F$5/50,vstupy!C55))*$I$5,0)","v":329},{"$f":"ROUND((vstupy!D47*POWER($F$5/50,vstupy!D55))*$I$5,0)","v":429},{"$f":"ROUND((vstupy!E47*POWER($F$5/50,vstupy!E55))*$I$5,0)","v":596},{"$f":"ROUND((vstupy!F47*POWER($F$5/50,vstupy!F55))*$I$5,0)","v":750},{"$f":"ROUND((vstupy!G47*POWER($F$5/50,vstupy!G55))*$I$5,0)","v":934},{"$f":"ROUND((vstupy!H47*POWER($F$5/50,vstupy!H55))*$I$5,0)","v":329},{"$f":"ROUND((vstupy!I47*POWER($F$5/50,vstupy!I55))*$I$5,0)","v":429},{"$f":"ROUND((vstupy!J47*POWER($F$5/50,vstupy!J55))*$I$5,0)","v":596},{"$f":"ROUND((vstupy!K47*POWER($F$5/50,vstupy!K55))*$I$5,0)","v":750},{"$f":"ROUND((vstupy!L47*POWER($F$5/50,vstupy!L55))*$I$5,0)","v":934},600,null,600,{"$f":"ROUND((vstupy!P47*POWER($F$5/50,vstupy!P55))*$I$5,0)","v":372},{"$f":"ROUND((vstupy!Q47*POWER($F$5/50,vstupy!Q55))*$I$5,0)","v":482},{"$f":"ROUND((vstupy!R47*POWER($F$5/50,vstupy!R55))*$I$5,0)","v":662},{"$f":"ROUND((vstupy!S47*POWER($F$5/50,vstupy!S55))*$I$5,0)","v":820},{"$f":"ROUND((vstupy!T47*POWER($F$5/50,vstupy!T55))*$I$5,0)","v":1003},null,null,null,null,null,600]
[null,750,{"$f":"ROUND((((($C$5-$D$5)/(LN(($C$5-$E$5)/($D$5-$E$5))))/49.8328865456397)^vstupy!C56)*vstupy!C48*$I$5,0)","v":400},{"$f":"ROUND((((($C$5-$D$5)/(LN(($C$5-$E$5)/($D$5-$E$5))))/49.8328865456397)^vstupy!D56)*vstupy!D48*$I$5,0)","v":522},{"$f":"ROUND((((($C$5-$D$5)/(LN(($C$5-$E$5)/($D$5-$E$5))))/49.8328865456397)^vstupy!E56)*vstupy!E48*$I$5,0)","v":726},{"$f":"ROUND((((($C$5-$D$5)/(LN(($C$5-$E$5)/($D$5-$E$5))))/49.8328865456397)^vstupy!F56)*vstupy!F48*$I$5,0)","v":913},{"$f":"ROUND((((($C$5-$D$5)/(LN(($C$5-$E$5)/($D$5-$E$5))))/49.8328865456397)^vstupy!G56)*vstupy!G48*$I$5,0)","v":1138},{"$f":"ROUND((((($C$5-$D$5)/(LN(($C$5-$E$5)/($D$5-$E$5))))/49.8328865456397)^vstupy!H56)*vstupy!H48*$I$5,0)","v":400},{"$f":"ROUND((((($C$5-$D$5)/(LN(($C$5-$E$5)/($D$5-$E$5))))/49.8328865456397)^vstupy!I56)*vstupy!I48*$I$5,0)","v":522},{"$f":"ROUND((((($C$5-$D$5)/(LN(($C$5-$E$5)/($D$5-$E$5))))/49.8328865456397)^vstupy!J56)*vstupy!J48*$I$5,0)","v":726},{"$f":"ROUND((((($C$5-$D$5)/(LN(($C$5-$E$5)/($D$5-$E$5))))/49.8328865456397)^vstupy!K56)*vstupy!K48*$I$5,0)","v":913},{"$f":"ROUND((((($C$5-$D$5)/(LN(($C$5-$E$5)/($D$5-$E$5))))/49.8328865456397)^vstupy!L56)*vstupy!L48*$I$5,0)","v":1138},750,null,750,{"$f":"ROUND((((($C$5-$D$5)/(LN(($C$5-$E$5)/($D$5-$E$5))))/49.8328865456397)^vstupy!P56)*vstupy!P48*$I$5,0)","v":449},{"$f":"ROUND((((($C$5-$D$5)/(LN(($C$5-$E$5)/($D$5-$E$5))))/49.8328865456397)^vstupy!Q56)*vstupy!Q48*$I$5,0)","v":583},{"$f":"ROUND((((($C$5-$D$5)/(LN(($C$5-$E$5)/($D$5-$E$5))))/49.8328865456397)^vstupy!R56)*vstupy!R48*$I$5,0)","v":799},{"$f":"ROUND((((($C$5-$D$5)/(LN(($C$5-$E$5)/($D$5-$E$5))))/49.8328865456397)^vstupy!S56)*vstupy!S48*$I$5,0)","v":991},{"$f":"ROUND((((($C$5-$D$5)/(LN(($C$5-$E$5)/($D$5-$E$5))))/49.8328865456397)^vstupy!T56)*vstupy!T48*$I$5,0)","v":1211},null,null,null,null,null,750,null,null,750,{"$f":"ROUND((vstupy!C48*POWER($F$5/50,vstupy!C56))*$I$5,0)","v":400},{"$f":"ROUND((vstupy!D48*POWER($F$5/50,vstupy!D56))*$I$5,0)","v":522},{"$f":"ROUND((vstupy!E48*POWER($F$5/50,vstupy!E56))*$I$5,0)","v":726},{"$f":"ROUND((vstupy!F48*POWER($F$5/50,vstupy!F56))*$I$5,0)","v":913},{"$f":"ROUND((vstupy!G48*POWER($F$5/50,vstupy!G56))*$I$5,0)","v":1138},{"$f":"ROUND((vstupy!H48*POWER($F$5/50,vstupy!H56))*$I$5,0)","v":400},{"$f":"ROUND((vstupy!I48*POWER($F$5/50,vstupy!I56))*$I$5,0)","v":522},{"$f":"ROUND((vstupy!J48*POWER($F$5/50,vstupy!J56))*$I$5,0)","v":726},{"$f":"ROUND((vstupy!K48*POWER($F$5/50,vstupy!K56))*$I$5,0)","v":913},{"$f":"ROUND((vstupy!L48*POWER($F$5/50,vstupy!L56))*$I$5,0)","v":1138},750,null,750,{"$f":"ROUND((vstupy!P48*POWER($F$5/50,vstupy!P56))*$I$5,0)","v":449},{"$f":"ROUND((vstupy!Q48*POWER($F$5/50,vstupy!Q56))*$I$5,0)","v":583},{"$f":"ROUND((vstupy!R48*POWER($F$5/50,vstupy!R56))*$I$5,0)","v":799},{"$f":"ROUND((vstupy!S48*POWER($F$5/50,vstupy!S56))*$I$5,0)","v":991},{"$f":"ROUND((vstupy!T48*POWER($F$5/50,vstupy!T56))*$I$5,0)","v":1211},null,null,null,null,null,750]
[]
[null,null,"KORALUX STANDARD",null,null,null,null,null,null,null,null,null,null,null,null,"KORALUX STANDARD",null,null,null,null,null,null,null,null,null,null,null,null,null,"KORALUX STANDARD",null,null,null,null,null,null,null,null,null,null,null,null,"KORALUX STANDARD"]
[null,"Délka L","Výška H [mm]",null,null,null,null,null,"KORALUX NEO",null,null,null,null,null,"Délka L","Výška H [mm]",null,null,null,null,null,"KORALUX NEO",null,null,null,null,null,null,"Délka L","Výška H [mm]",null,null,null,null,null,"KORALUX NEO",null,null,null,null,null,"Délka L","Výška H [mm]",null,null,null,null,null,"KORALUX NEO"]
[null,"[mm]",700,900,1220,1500,null,"Délka L","Výška H [mm]",null,null,null,null,null,"[mm]",700,900,1220,1500,null,"Délka L","Výška H [mm]",null,null,null,null,null,null,"[mm]",700,900,1220,1500,null,"Délka L","Výška H [mm]",null,null,null,null,null,"[mm]",700,900,1220,1500,null,"Délka L","Výška H [mm]"]
[null,400,{"$f":"ROUND((((($C$5-$D$5)/(LN(($C$5-$E$5)/($D$5-$E$5))))/49.8328865456397)^vstupy!C68)*vstupy!C61*$I$5,0)","v":198},{"$f":"ROUND((((($C$5-$D$5)/(LN(($C$5-$E$5)/($D$5-$E$5))))/49.8328865456397)^vstupy!D68)*vstupy!D61*$I$5,0)","v":254},{"$f":"ROUND((((($C$5-$D$5)/(LN(($C$5-$E$5)/($D$5-$E$5))))/49.8328865456397)^vstupy!E68)*vstupy!E61*$I$5,0)","v":345},{"$f":"ROUND((((($C$5-$D$5)/(LN(($C$5-$E$5)/($D$5-$E$5))))/49.8328865456397)^vstupy!F68)*vstupy!F61*$I$5,0)","v":427},null,"[mm]",1100,1420,1700,null,null,null,400,{"$f":"ROUND((((($C$5-$D$5)/(LN(($C$5-$E$5)/($D$5-$E$5))))/49.8328865456397)^vstupy!P68)*vstupy!P61*$I$5,0)","v":213},{"$f":"ROUND((((($C$5-$D$5)/(LN(($C$5-$E$5)/($D$5-$E$5))))/49.8328865456397)^vstupy!Q68)*vstupy!Q61*$I$5,0)","v":275},{"$f":"ROUND((((($C$5-$D$5)/(LN(($C$5-$E$5)/($D$5-$E$5))))/49.8328865456397)^vstupy!R68)*vstupy!R61*$I$5,0)","v":373},{"$f":"ROUND((((($C$5-$D$5)/(LN(($C$5-$E$5)/($D$5-$E$5))))/49.8328865456397)^vstupy!S68)*vstupy!S61*$I$5,0)","v":458},null,"[mm]",1095,1415,1695,null,null,null,null,400,{"$f":"ROUND((vstupy!C61*POWER($F$5/50,vstupy!C68))*$I$5,0)","v":198},{"$f":"ROUND((vstupy!D61*POWER($F$5/50,vstupy!D68))*$I$5,0)","v":254},{"$f":"ROUND((vstupy!E61*POWER($F$5/50,vstupy!E68))*$I$5,0)","v":345},{"$f":"ROUND((vstupy!F61*POWER($F$5/50,vstupy!F68))*$I$5,0)","v":427},null,"[mm]",1100,1420,1700,null,null,null,400,{"$f":"ROUND((vstupy!P61*POWER($F$5/50,vstupy!P68))*$I$5,0)","v":213},{"$f":"ROUND((vstupy!Q61*POWER($F$5/50,vstupy!Q68))*$I$5,0)","v":275},{"$f":"ROUND((vstupy!R61*POWER($F$5/50,vstupy!R68))*$I$5,0)","v":373},{"$f":"ROUND((vstupy!S61*POWER($F$5/50,vstupy!S68))*$I$5,0)","v":458},null,"[mm]",1095,1415,1695]
[null,500,{"$f":"ROUND((((($C$5-$D$5)/(LN(($C$5-$E$5)/($D$5-$E$5))))/49.8328865456397)^vstupy!C69)*vstupy!C62*$I$5,0)","v":231},{"$f":"ROUND((((($C$5-$D$5)/(LN(($C$5-$E$5)/($D$5-$E$5))))/49.8328865456397)^vstupy!D69)*vstupy!D62*$I$5,0)","v":297},{"$f":"ROUND((((($C$5-$D$5)/(LN(($C$5-$E$5)/($D$5-$E$5))))/49.8328865456397)^vstupy!E69)*vstupy!E62*$I$5,0)","v":403},{"$f":"ROUND((((($C$5-$D$5)/(LN(($C$5-$E$5)/($D$5-$E$5))))/49.8328865456397)^vstupy!F69)*vstupy!F62*$I$5,0)","v":499},null,500,{"$f":"ROUND((((($C$5-$D$5)/(LN(($C$5-$E$5)/($D$5-$E$5))))/49.8328865456397)^vstupy!C155)*vstupy!C149*$I$5,0)","v":520},{"$f":"ROUND((((($C$5-$D$5)/(LN(($C$5-$E$5)/($D$5-$E$5))))/49.8328865456397)^vstupy!D155)*vstupy!D149*$I$5,0)","v":670},{"$f":"ROUND((((($C$5-$D$5)/(LN(($C$5-$E$5)/($D$5-$E$5))))/49.8328865456397)^vstupy!E155)*vstupy!E149*$I$5,0)","v":803},null,null,null,500,{"$f":"ROUND((((($C$5-$D$5)/(LN(($C$5-$E$5)/($D$5-$E$5))))/49.8328865456397)^vstupy!P69)*vstupy!P62*$I$5,0)","v":249},{"$f":"ROUND((((($C$5-$D$5)/(LN(($C$5-$E$5)/($D$5-$E$5))))/49.8328865456397)^vstupy!Q69)*vstupy!Q62*$I$5,0)","v":322},{"$f":"ROUND((((($C$5-$D$5)/(LN(($C$5-$E$5)/($D$5-$E$5))))/49.8328865456397)^vstupy!R69)*vstupy!R62*$I$5,0)","v":436},{"$f":"ROUND((((($C$5-$D$5)/(LN(($C$5-$E$5)/($D$5-$E$5))))/49.8328865456397)^vstupy!S69)*vstupy!S62*$I$5,0)","v":536},null,500,null,null,null,null,null,null,null,500,{"$f":"ROUND((vstupy!C62*POWER($F$5/50,vstupy!C69))*$I$5,0)","v":231},{"$f":"ROUND((vstupy!D62*POWER($F$5/50,vstupy!D69))*$I$5,0)","v":297},{"$f":"ROUND((vstupy!E62*POWER($F$5/50,vstupy!E69))*$I$5,0)","v":403},{"$f":"ROUND((vstupy!F62*POWER($F$5/50,vstupy!F69))*$I$5,0)","v":499},null,500,{"$f":"ROUND((vstupy!C149*POWER($F$5/50,vstupy!C155))*$I$5,0)","v":520},{"$f":"ROUND((vstupy!D149*POWER($F$5/50,vstupy!D155))*$I$5,0)","v":670},{"$f":"ROUND((vstupy!E149*POWER($F$5/50,vstupy!E155))*$I$5,0)","v":803},null,null,null,500,{"$f":"ROUND((vstupy!P62*POWER($F$5/50,vstupy!P69))*$I$5,0)","v":249},{"$f":"ROUND((vstupy!Q62*POWER($F$5/50,vstupy!Q69))*$I$5,0)","v":322},{"$f":"ROUND((vstupy!R62*POWER($F$5/50,vstupy!R69))*$I$5,0)","v":436},{"$f":"ROUND((vstupy!S62*POWER($F$5/50,vstupy!S69))*$I$5,0)","v":536},null,500]
[null,600,{"$f":"ROUND((((($C$5-$D$5)/(LN(($C$5-$E$5)/($D$5-$E$5))))/49.8328865456397)^vstupy!C70)*vstupy!C63*$I$5,0)","v":263},{"$f":"ROUND((((($C$5-$D$5)/(LN(($C$5-$E$5)/($D$5-$E$5))))/49.8328865456397)^vstupy!D70)*vstupy!D63*$I$5,0)","v":337},{"$f":"ROUND((((($C$5-$D$5)/(LN(($C$5-$E$5)/($D$5-$E$5))))/49.8328865456397)^vstupy!E70)*vstupy!E63*$I$5,0)","v":458},{"$f":"ROUND((((($C$5-$D$5)/(LN(($C$5-$E$5)/($D$5-$E$5))))/49.8328865456397)^vstupy!F70)*vstupy!F63*$I$5,0)","v":567},null,600,{"$f":"ROUND((((($C$5-$D$5)/(LN(($C$5-$E$5)/($D$5-$E$5))))/49.8328865456397)^vstupy!C156)*vstupy!C150*$I$5,0)","v":593},{"$f":"ROUND((((($C$5-$D$5)/(LN(($C$5-$E$5)/($D$5-$E$5))))/49.8328865456397)^vstupy!D156)*vstupy!D150*$I$5,0)","v":763},{"$f":"ROUND((((($C$5-$D$5)/(LN(($C$5-$E$5)/($D$5-$E$5))))/49.8328865456397)^vstupy!E156)*vstupy!E150*$I$5,0)","v":914},null,null,null,600,{"$f":"ROUND((((($C$5-$D$5)/(LN(($C$5-$E$5)/($D$5-$E$5))))/49.8328865456397)^vstupy!P70)*vstupy!P63*$I$5,0)","v":283},{"$f":"ROUND((((($C$5-$D$5)/(LN(($C$5-$E$5)/($D$5-$E$5))))/49.8328865456397)^vstupy!Q70)*vstupy!Q63*$I$5,0)","v":365},{"$f":"ROUND((((($C$5-$D$5)/(LN(($C$5-$E$5)/($D$5-$E$5))))/49.8328865456397)^vstupy!R70)*vstupy!R63*$I$5,0)","v":496},{"$f":"ROUND((((($C$5-$D$5)/(LN(($C$5-$E$5)/($D$5-$E$5))))/49.8328865456397)^vstupy!S70)*vstupy!S63*$I$5,0)","v":609},null,600,null,null,null,null,null,null,null,600,{"$f":"ROUND((vstupy!C63*POWER($F$5/50,vstupy!C70))*$I$5,0)","v":263},{"$f":"ROUND((vstupy!D63*POWER($F$5/50,vstupy!D70))*$I$5,0)","v":337},{"$f":"ROUND((vstupy!E63*POWER($F$5/50,vstupy!E70))*$I$5,0)","v":458},{"$f":"ROUND((vstupy!F63*POWER($F$5/50,vstupy!F70))*$I$5,0)","v":567},null,600,{"$f":"ROUND((vstupy!C150*POWER($F$5/50,vstupy!C156))*$I$5,0)","v":593},{"$f":"ROUND((vstupy!D150*POWER($F$5/50,vstupy!D156))*$I$5,0)","v":763},{"$f":"ROUND((vstupy!E150*POWER($F$5/50,vstupy!E156))*$I$5,0)","v":914},null,null,null,600,{"$f":"ROUND((vstupy!P63*POWER($F$5/50,vstupy!P70))*$I$5,0)","v":283},{"$f":"ROUND((vstupy!Q63*POWER($F$5/50,vstupy!Q70))*$I$5,0)","v":365},{"$f":"ROUND((vstupy!R63*POWER($F$5/50,vstupy!R70))*$I$5,0)","v":496},{"$f":"ROUND((vstupy!S63*POWER($F$5/50,vstupy!S70))*$I$5,0)","v":609},null,600]
[]
[null,null,"KORALUX LINEAR EXCLUSIVE - M",null,null,null,null,null,null,null,null,null,null,null,null,"KORALUX LINEAR EXCLUSIVE - M",null,null,null,null,null,null,null,null,null,null,null,null,null,"KORALUX LINEAR EXCLUSIVE - M",null,null,null,null,null,null,null,null,null,null,null,null,"KORALUX LINEAR EXCLUSIVE - M"]
[null,"Délka L","Výška H [mm]",null,null,null,null,null,null,null,null,null,null,null,"Délka L","Výška H [mm]",null,null,null,null,null,null,null,null,null,null,null,null,"Délka L","Výška H [mm]",null,null,null,null,null,null,null,null,null,null,null,"Délka L","Výška H [mm]"]
[null,"[mm]",{"$f":"logic!$L$4","v":"Długość"},1220,1500,1820,null,null,null,null,null,null,null,null,"[mm]",900,1220,1500,1820,null,null,null,null,null,null,null,null,null,"[mm]",{"$f":"logic!$L$4","v":"Długość"},1220,1500,1820,null,null,null,null,null,null,null,null,"[mm]",900,1220,1500,1820]
[null,450,{"$f":"ROUND((((($C$5-$D$5)/(LN(($C$5-$E$5)/($D$5-$E$5))))/49.8328865456397)^vstupy!C82)*vstupy!C75*$I$5,0)","v":249},{"$f":"ROUND((((($C$5-$D$5)/(LN(($C$5-$E$5)/($D$5-$E$5))))/49.8328865456397)^vstupy!D82)*vstupy!D75*$I$5,0)","v":338},{"$f":"ROUND((((($C$5-$D$5)/(LN(($C$5-$E$5)/($D$5-$E$5))))/49.8328865456397)^vstupy!E82)*vstupy!E75*$I$5,0)","v":419},{"$f":"ROUND((((($C$5-$D$5)/(LN(($C$5-$E$5)/($D$5-$E$5))))/49.8328865456397)^vstupy!F82)*vstupy!F75*$I$5,0)","v":516},null,null,null,null,null,null,null,null,450,null,null,null,null,null,null,null,null,null,null,null,null,null,450,{"$f":"ROUND((vstupy!C75*POWER($F$5/50,vstupy!C82))*$I$5,0)","v":249},{"$f":"ROUND((vstupy!D75*POWER($F$5/50,vstupy!D82))*$I$5,0)","v":338},{"$f":"ROUND((vstupy!E75*POWER($F$5/50,vstupy!E82))*$I$5,0)","v":419},{"$f":"ROUND((vstupy!F75*POWER($F$5/50,vstupy!F82))*$I$5,0)","v":516},null,null,null,null,null,null,null,null,450]
[null,600,{"$f":"ROUND((((($C$5-$D$5)/(LN(($C$5-$E$5)/($D$5-$E$5))))/49.8328865456397)^vstupy!C83)*vstupy!C76*$I$5,0)","v":319},{"$f":"ROUND((((($C$5-$D$5)/(LN(($C$5-$E$5)/($D$5-$E$5))))/49.8328865456397)^vstupy!D83)*vstupy!D76*$I$5,0)","v":433},{"$f":"ROUND((((($C$5-$D$5)/(LN(($C$5-$E$5)/($D$5-$E$5))))/49.8328865456397)^vstupy!E83)*vstupy!E76*$I$5,0)","v":537},{"$f":"ROUND((((($C$5-$D$5)/(LN(($C$5-$E$5)/($D$5-$E$5))))/49.8328865456397)^vstupy!F83)*vstupy!F76*$I$5,0)","v":662},null,null,null,null,null,null,null,null,600,null,null,null,null,null,null,null,null,null,null,null,null,null,600,{"$f":"ROUND((vstupy!C76*POWER($F$5/50,vstupy!C83))*$I$5,0)","v":319},{"$f":"ROUND((vstupy!D76*POWER($F$5/50,vstupy!D83))*$I$5,0)","v":433},{"$f":"ROUND((vstupy!E76*POWER($F$5/50,vstupy!E83))*$I$5,0)","v":537},{"$f":"ROUND((vstupy!F76*POWER($F$5/50,vstupy!F83))*$I$5,0)","v":662},null,null,null,null,null,null,null,null,600]
[null,750,{"$f":"ROUND((((($C$5-$D$5)/(LN(($C$5-$E$5)/($D$5-$E$5))))/49.8328865456397)^vstupy!C84)*vstupy!C77*$I$5,0)","v":387},{"$f":"ROUND((((($C$5-$D$5)/(LN(($C$5-$E$5)/($D$5-$E$5))))/49.8328865456397)^vstupy!D84)*vstupy!D77*$I$5,0)","v":526},{"$f":"ROUND((((($C$5-$D$5)/(LN(($C$5-$E$5)/($D$5-$E$5))))/49.8328865456397)^vstupy!E84)*vstupy!E77*$I$5,0)","v":652},{"$f":"ROUND((((($C$5-$D$5)/(LN(($C$5-$E$5)/($D$5-$E$5))))/49.8328865456397)^vstupy!F84)*vstupy!F77*$I$5,0)","v":802},null,null,null,null,null,null,null,null,750,null,null,null,null,null,null,null,null,null,null,null,null,null,750,{"$f":"ROUND((vstupy!C77*POWER($F$5/50,vstupy!C84))*$I$5,0)","v":387},{"$f":"ROUND((vstupy!D77*POWER($F$5/50,vstupy!D84))*$I$5,0)","v":526},{"$f":"ROUND((vstupy!E77*POWER($F$5/50,vstupy!E84))*$I$5,0)","v":652},{"$f":"ROUND((vstupy!F77*POWER($F$5/50,vstupy!F84))*$I$5,0)","v":802},null,null,null,null,null,null,null,null,750]
[]
[null,null,"KORALUX RONDO MAX",null,null,null,null,"KORALUX RONDO MAX - M",null,null,null,null,null,null,null,"KORALUX RONDO MAX",null,null,null,null,"KORALUX RONDO MAX - M",null,null,null,null,null,null,null,null,"KORALUX RONDO MAX",null,null,null,null,"KORALUX RONDO MAX - M",null,null,null,null,null,null,null,"KORALUX RONDO MAX",null,null,null,null,"KORALUX RONDO MAX - M"]
[null,"Délka L","Výška H [mm]",null,null,null,null,"Výška H [mm]",null,null,null,null,"Délka L",null,"Délka L","Výška H [mm]",null,null,null,null,"Výška H [mm]",null,null,null,null,"Délka L",null,null,"Délka L","Výška H [mm]",null,null,null,null,"Výška H [mm]",null,null,null,null,"Délka L",null,"Délka L","Výška H [mm]",null,null,null,null,"Výška H [mm]",null,null,null,null,"Délka L"]
[null,"[mm]",700,900,1220,1500,1820,700,900,1220,1500,1820,"[mm]",null,"[mm]",700,900,1220,1500,1820,700,900,1220,1500,1820,"[mm]",null,null,"[mm]",700,900,1220,1500,1820,700,900,1220,1500,1820,"[mm]",null,"[mm]",700,900,1220,1500,1820,700,900,1220,1500,1820,"[mm]"]
[null,450,{"$f":"ROUND((((($C$5-$D$5)/(LN(($C$5-$E$5)/($D$5-$E$5))))/49.8328865456397)^vstupy!C96)*vstupy!C89*$I$5,0)","v":335},{"$f":"ROUND((((($C$5-$D$5)/(LN(($C$5-$E$5)/($D$5-$E$5))))/49.8328865456397)^vstupy!D96)*vstupy!D89*$I$5,0)","v":432},{"$f":"ROUND((((($C$5-$D$5)/(LN(($C$5-$E$5)/($D$5-$E$5))))/49.8328865456397)^vstupy!E96)*vstupy!E89*$I$5,0)","v":589},{"$f":"ROUND((((($C$5-$D$5)/(LN(($C$5-$E$5)/($D$5-$E$5))))/49.8328865456397)^vstupy!F96)*vstupy!F89*$I$5,0)","v":725},{"$f":"ROUND((((($C$5-$D$5)/(LN(($C$5-$E$5)/($D$5-$E$5))))/49.8328865456397)^vstupy!G96)*vstupy!G89*$I$5,0)","v":879},{"$f":"ROUND((((($C$5-$D$5)/(LN(($C$5-$E$5)/($D$5-$E$5))))/49.8328865456397)^vstupy!H96)*vstupy!H89*$I$5,0)","v":335},{"$f":"ROUND((((($C$5-$D$5)/(LN(($C$5-$E$5)/($D$5-$E$5))))/49.8328865456397)^vstupy!I96)*vstupy!I89*$I$5,0)","v":432},{"$f":"ROUND((((($C$5-$D$5)/(LN(($C$5-$E$5)/($D$5-$E$5))))/49.8328865456397)^vstupy!J96)*vstupy!J89*$I$5,0)","v":589},{"$f":"ROUND((((($C$5-$D$5)/(LN(($C$5-$E$5)/($D$5-$E$5))))/49.8328865456397)^vstupy!K96)*vstupy!K89*$I$5,0)","v":725},{"$f":"ROUND((((($C$5-$D$5)/(LN(($C$5-$E$5)/($D$5-$E$5))))/49.8328865456397)^vstupy!L96)*vstupy!L89*$I$5,0)","v":879},450,null,450,{"$f":"ROUND((((($C$5-$D$5)/(LN(($C$5-$E$5)/($D$5-$E$5))))/49.8328865456397)^vstupy!P96)*vstupy!P89*$I$5,0)","v":361},{"$f":"ROUND((((($C$5-$D$5)/(LN(($C$5-$E$5)/($D$5-$E$5))))/49.8328865456397)^vstupy!Q96)*vstupy!Q89*$I$5,0)","v":462},{"$f":"ROUND((((($C$5-$D$5)/(LN(($C$5-$E$5)/($D$5-$E$5))))/49.8328865456397)^vstupy!R96)*vstupy!R89*$I$5,0)","v":625},{"$f":"ROUND((((($C$5-$D$5)/(LN(($C$5-$E$5)/($D$5-$E$5))))/49.8328865456397)^vstupy!S96)*vstupy!S89*$I$5,0)","v":771},{"$f":"ROUND((((($C$5-$D$5)/(LN(($C$5-$E$5)/($D$5-$E$5))))/49.8328865456397)^vstupy!T96)*vstupy!T89*$I$5,0)","v":942},null,null,null,null,null,450,null,null,450,{"$f":"ROUND((vstupy!C89*POWER($F$5/50,vstupy!C96))*$I$5,0)","v":335},{"$f":"ROUND((vstupy!D89*POWER($F$5/50,vstupy!D96))*$I$5,0)","v":432},{"$f":"ROUND((vstupy!E89*POWER($F$5/50,vstupy!E96))*$I$5,0)","v":589},{"$f":"ROUND((vstupy!F89*POWER($F$5/50,vstupy!F96))*$I$5,0)","v":725},{"$f":"ROUND((vstupy!G89*POWER($F$5/50,vstupy!G96))*$I$5,0)","v":879},{"$f":"ROUND((vstupy!H89*POWER($F$5/50,vstupy!H96))*$I$5,0)","v":335},{"$f":"ROUND((vstupy!I89*POWER($F$5/50,vstupy!I96))*$I$5,0)","v":432},{"$f":"ROUND((vstupy!J89*POWER($F$5/50,vstupy!J96))*$I$5,0)","v":589},{"$f":"ROUND((vstupy!K89*POWER($F$5/50,vstupy!K96))*$I$5,0)","v":725},{"$f":"ROUND((vstupy!L89*POWER($F$5/50,vstupy!L96))*$I$5,0)","v":879},450,null,450,{"$f":"ROUND((vstupy!P89*POWER($F$5/50,vstupy!P96))*$I$5,0)","v":361},{"$f":"ROUND((vstupy!Q89*POWER($F$5/50,vstupy!Q96))*$I$5,0)","v":462},{"$f":"ROUND((vstupy!R89*POWER($F$5/50,vstupy!R96))*$I$5,0)","v":625},{"$f":"ROUND((vstupy!S89*POWER($F$5/50,vstupy!S96))*$I$5,0)","v":771},{"$f":"ROUND((vstupy!T89*POWER($F$5/50,vstupy!T96))*$I$5,0)","v":942},null,null,null,null,null,450]
[null,600,{"$f":"ROUND((((($C$5-$D$5)/(LN(($C$5-$E$5)/($D$5-$E$5))))/49.8328865456397)^vstupy!C97)*vstupy!C90*$I$5,0)","v":444},{"$f":"ROUND((((($C$5-$D$5)/(LN(($C$5-$E$5)/($D$5-$E$5))))/49.8328865456397)^vstupy!D97)*vstupy!D90*$I$5,0)","v":574},{"$f":"ROUND((((($C$5-$D$5)/(LN(($C$5-$E$5)/($D$5-$E$5))))/49.8328865456397)^vstupy!E97)*vstupy!E90*$I$5,0)","v":781},{"$f":"ROUND((((($C$5-$D$5)/(LN(($C$5-$E$5)/($D$5-$E$5))))/49.8328865456397)^vstupy!F97)*vstupy!F90*$I$5,0)","v":962},{"$f":"ROUND((((($C$5-$D$5)/(LN(($C$5-$E$5)/($D$5-$E$5))))/49.8328865456397)^vstupy!G97)*vstupy!G90*$I$5,0)","v":1166},{"$f":"ROUND((((($C$5-$D$5)/(LN(($C$5-$E$5)/($D$5-$E$5))))/49.8328865456397)^vstupy!H97)*vstupy!H90*$I$5,0)","v":444},{"$f":"ROUND((((($C$5-$D$5)/(LN(($C$5-$E$5)/($D$5-$E$5))))/49.8328865456397)^vstupy!I97)*vstupy!I90*$I$5,0)","v":574},{"$f":"ROUND((((($C$5-$D$5)/(LN(($C$5-$E$5)/($D$5-$E$5))))/49.8328865456397)^vstupy!J97)*vstupy!J90*$I$5,0)","v":781},{"$f":"ROUND((((($C$5-$D$5)/(LN(($C$5-$E$5)/($D$5-$E$5))))/49.8328865456397)^vstupy!K97)*vstupy!K90*$I$5,0)","v":962},{"$f":"ROUND((((($C$5-$D$5)/(LN(($C$5-$E$5)/($D$5-$E$5))))/49.8328865456397)^vstupy!L97)*vstupy!L90*$I$5,0)","v":1166},600,null,600,{"$f":"ROUND((((($C$5-$D$5)/(LN(($C$5-$E$5)/($D$5-$E$5))))/49.8328865456397)^vstupy!P97)*vstupy!P90*$I$5,0)","v":480},{"$f":"ROUND((((($C$5-$D$5)/(LN(($C$5-$E$5)/($D$5-$E$5))))/49.8328865456397)^vstupy!Q97)*vstupy!Q90*$I$5,0)","v":614},{"$f":"ROUND((((($C$5-$D$5)/(LN(($C$5-$E$5)/($D$5-$E$5))))/49.8328865456397)^vstupy!R97)*vstupy!R90*$I$5,0)","v":832},{"$f":"ROUND((((($C$5-$D$5)/(LN(($C$5-$E$5)/($D$5-$E$5))))/49.8328865456397)^vstupy!S97)*vstupy!S90*$I$5,0)","v":1026},{"$f":"ROUND((((($C$5-$D$5)/(LN(($C$5-$E$5)/($D$5-$E$5))))/49.8328865456397)^vstupy!T97)*vstupy!T90*$I$5,0)","v":1253},null,null,null,null,null,600,null,null,600,{"$f":"ROUND((vstupy!C90*POWER($F$5/50,vstupy!C97))*$I$5,0)","v":444},{"$f":"ROUND((vstupy!D90*POWER($F$5/50,vstupy!D97))*$I$5,0)","v":574},{"$f":"ROUND((vstupy!E90*POWER($F$5/50,vstupy!E97))*$I$5,0)","v":781},{"$f":"ROUND((vstupy!F90*POWER($F$5/50,vstupy!F97))*$I$5,0)","v":962},{"$f":"ROUND((vstupy!G90*POWER($F$5/50,vstupy!G97))*$I$5,0)","v":1166},{"$f":"ROUND((vstupy!H90*POWER($F$5/50,vstupy!H97))*$I$5,0)","v":444},{"$f":"ROUND((vstupy!I90*POWER($F$5/50,vstupy!I97))*$I$5,0)","v":574},{"$f":"ROUND((vstupy!J90*POWER($F$5/50,vstupy!J97))*$I$5,0)","v":781},{"$f":"ROUND((vstupy!K90*POWER($F$5/50,vstupy!K97))*$I$5,0)","v":962},{"$f":"ROUND((vstupy!L90*POWER($F$5/50,vstupy!L97))*$I$5,0)","v":1166},600,null,600,{"$f":"ROUND((vstupy!P90*POWER($F$5/50,vstupy!P97))*$I$5,0)","v":480},{"$f":"ROUND((vstupy!Q90*POWER($F$5/50,vstupy!Q97))*$I$5,0)","v":614},{"$f":"ROUND((vstupy!R90*POWER($F$5/50,vstupy!R97))*$I$5,0)","v":832},{"$f":"ROUND((vstupy!S90*POWER($F$5/50,vstupy!S97))*$I$5,0)","v":1026},{"$f":"ROUND((vstupy!T90*POWER($F$5/50,vstupy!T97))*$I$5,0)","v":1253},null,null,null,null,null,600]
[null,750,{"$f":"ROUND((((($C$5-$D$5)/(LN(($C$5-$E$5)/($D$5-$E$5))))/49.8328865456397)^vstupy!C98)*vstupy!C91*$I$5,0)","v":553},{"$f":"ROUND((((($C$5-$D$5)/(LN(($C$5-$E$5)/($D$5-$E$5))))/49.8328865456397)^vstupy!D98)*vstupy!D91*$I$5,0)","v":714},{"$f":"ROUND((((($C$5-$D$5)/(LN(($C$5-$E$5)/($D$5-$E$5))))/49.8328865456397)^vstupy!E98)*vstupy!E91*$I$5,0)","v":973},{"$f":"ROUND((((($C$5-$D$5)/(LN(($C$5-$E$5)/($D$5-$E$5))))/49.8328865456397)^vstupy!F98)*vstupy!F91*$I$5,0)","v":1197},{"$f":"ROUND((((($C$5-$D$5)/(LN(($C$5-$E$5)/($D$5-$E$5))))/49.8328865456397)^vstupy!G98)*vstupy!G91*$I$5,0)","v":1452},{"$f":"ROUND((((($C$5-$D$5)/(LN(($C$5-$E$5)/($D$5-$E$5))))/49.8328865456397)^vstupy!H98)*vstupy!H91*$I$5,0)","v":553},{"$f":"ROUND((((($C$5-$D$5)/(LN(($C$5-$E$5)/($D$5-$E$5))))/49.8328865456397)^vstupy!I98)*vstupy!I91*$I$5,0)","v":714},{"$f":"ROUND((((($C$5-$D$5)/(LN(($C$5-$E$5)/($D$5-$E$5))))/49.8328865456397)^vstupy!J98)*vstupy!J91*$I$5,0)","v":973},{"$f":"ROUND((((($C$5-$D$5)/(LN(($C$5-$E$5)/($D$5-$E$5))))/49.8328865456397)^vstupy!K98)*vstupy!K91*$I$5,0)","v":1197},{"$f":"ROUND((((($C$5-$D$5)/(LN(($C$5-$E$5)/($D$5-$E$5))))/49.8328865456397)^vstupy!L98)*vstupy!L91*$I$5,0)","v":1452},750,null,750,{"$f":"ROUND((((($C$5-$D$5)/(LN(($C$5-$E$5)/($D$5-$E$5))))/49.8328865456397)^vstupy!P98)*vstupy!P91*$I$5,0)","v":599},{"$f":"ROUND((((($C$5-$D$5)/(LN(($C$5-$E$5)/($D$5-$E$5))))/49.8328865456397)^vstupy!Q98)*vstupy!Q91*$I$5,0)","v":767},{"$f":"ROUND((((($C$5-$D$5)/(LN(($C$5-$E$5)/($D$5-$E$5))))/49.8328865456397)^vstupy!R98)*vstupy!R91*$I$5,0)","v":1038},{"$f":"ROUND((((($C$5-$D$5)/(LN(($C$5-$E$5)/($D$5-$E$5))))/49.8328865456397)^vstupy!S98)*vstupy!S91*$I$5,0)","v":1280},{"$f":"ROUND((((($C$5-$D$5)/(LN(($C$5-$E$5)/($D$5-$E$5))))/49.8328865456397)^vstupy!T98)*vstupy!T91*$I$5,0)","v":1564},null,null,null,null,null,750,null,null,750,{"$f":"ROUND((vstupy!C91*POWER($F$5/50,vstupy!C98))*$I$5,0)","v":553},{"$f":"ROUND((vstupy!D91*POWER($F$5/50,vstupy!D98))*$I$5,0)","v":714},{"$f":"ROUND((vstupy!E91*POWER($F$5/50,vstupy!E98))*$I$5,0)","v":973},{"$f":"ROUND((vstupy!F91*POWER($F$5/50,vstupy!F98))*$I$5,0)","v":1197},{"$f":"ROUND((vstupy!G91*POWER($F$5/50,vstupy!G98))*$I$5,0)","v":1452},{"$f":"ROUND((vstupy!H91*POWER($F$5/50,vstupy!H98))*$I$5,0)","v":553},{"$f":"ROUND((vstupy!I91*POWER($F$5/50,vstupy!I98))*$I$5,0)","v":714},{"$f":"ROUND((vstupy!J91*POWER($F$5/50,vstupy!J98))*$I$5,0)","v":973},{"$f":"ROUND((vstupy!K91*POWER($F$5/50,vstupy!K98))*$I$5,0)","v":1197},{"$f":"ROUND((vstupy!L91*POWER($F$5/50,vstupy!L98))*$I$5,0)","v":1452},750,null,750,{"$f":"ROUND((vstupy!P91*POWER($F$5/50,vstupy!P98))*$I$5,0)","v":599},{"$f":"ROUND((vstupy!Q91*POWER($F$5/50,vstupy!Q98))*$I$5,0)","v":767},{"$f":"ROUND((vstupy!R91*POWER($F$5/50,vstupy!R98))*$I$5,0)","v":1038},{"$f":"ROUND((vstupy!S91*POWER($F$5/50,vstupy!S98))*$I$5,0)","v":1280},{"$f":"ROUND((vstupy!T91*POWER($F$5/50,vstupy!T98))*$I$5,0)","v":1564},null,null,null,null,null,750]
[]
[null,null,"KORALUX RONDO COMFORT",null,null,null,null,"KORALUX RONDO COMFORT - M",null,null,null,null,null,null,null,"KORALUX RONDO COMFORT",null,null,null,null,"KORALUX RONDO COMFORT - M",null,null,null,null,null,null,null,null,"KORALUX RONDO COMFORT",null,null,null,null,"KORALUX RONDO COMFORT - M",null,null,null,null,null,null,null,"KORALUX RONDO COMFORT",null,null,null,null,"KORALUX RONDO COMFORT - M"]
[null,"Délka L","Výška H [mm]",null,null,null,null,"Výška H [mm]",null,null,null,null,"Délka L",null,"Délka L","Výška H [mm]",null,null,null,null,"Výška H [mm]",null,null,null,null,"Délka L",null,null,"Délka L","Výška H [mm]",null,null,null,null,"Výška H [mm]",null,null,null,null,"Délka L",null,"Délka L","Výška H [mm]",null,null,null,null,"Výška H [mm]",null,null,null,null,"Délka L"]
[null,"[mm]",700,900,1220,1500,1820,700,900,1220,1500,1820,"[mm]",null,"[mm]",700,900,1220,1500,1820,700,900,1220,1500,1820,"[mm]",null,null,"[mm]",700,900,1220,1500,1820,700,900,1220,1500,1820,"[mm]",null,"[mm]",700,900,1220,1500,1820,700,900,1220,1500,1820,"[mm]"]
[null,450,{"$f":"ROUND((((($C$5-$D$5)/(LN(($C$5-$E$5)/($D$5-$E$5))))/49.8328865456397)^vstupy!C111)*vstupy!C103*$I$5,0)","v":287},{"$f":"ROUND((((($C$5-$D$5)/(LN(($C$5-$E$5)/($D$5-$E$5))))/49.8328865456397)^vstupy!D111)*vstupy!D103*$I$5,0)","v":369},{"$f":"ROUND((((($C$5-$D$5)/(LN(($C$5-$E$5)/($D$5-$E$5))))/49.8328865456397)^vstupy!E111)*vstupy!E103*$I$5,0)","v":504},{"$f":"ROUND((((($C$5-$D$5)/(LN(($C$5-$E$5)/($D$5-$E$5))))/49.8328865456397)^vstupy!F111)*vstupy!F103*$I$5,0)","v":626},{"$f":"ROUND((((($C$5-$D$5)/(LN(($C$5-$E$5)/($D$5-$E$5))))/49.8328865456397)^vstupy!G111)*vstupy!G103*$I$5,0)","v":772},{"$f":"ROUND((((($C$5-$D$5)/(LN(($C$5-$E$5)/($D$5-$E$5))))/49.8328865456397)^vstupy!H111)*vstupy!H103*$I$5,0)","v":287},{"$f":"ROUND((((($C$5-$D$5)/(LN(($C$5-$E$5)/($D$5-$E$5))))/49.8328865456397)^vstupy!I111)*vstupy!I103*$I$5,0)","v":369},{"$f":"ROUND((((($C$5-$D$5)/(LN(($C$5-$E$5)/($D$5-$E$5))))/49.8328865456397)^vstupy!J111)*vstupy!J103*$I$5,0)","v":504},{"$f":"ROUND((((($C$5-$D$5)/(LN(($C$5-$E$5)/($D$5-$E$5))))/49.8328865456397)^vstupy!K111)*vstupy!K103*$I$5,0)","v":626},{"$f":"ROUND((((($C$5-$D$5)/(LN(($C$5-$E$5)/($D$5-$E$5))))/49.8328865456397)^vstupy!L111)*vstupy!L103*$I$5,0)","v":772},450,null,450,{"$f":"ROUND((((($C$5-$D$5)/(LN(($C$5-$E$5)/($D$5-$E$5))))/49.8328865456397)^vstupy!P111)*vstupy!P103*$I$5,0)","v":312},{"$f":"ROUND((((($C$5-$D$5)/(LN(($C$5-$E$5)/($D$5-$E$5))))/49.8328865456397)^vstupy!Q111)*vstupy!Q103*$I$5,0)","v":402},{"$f":"ROUND((((($C$5-$D$5)/(LN(($C$5-$E$5)/($D$5-$E$5))))/49.8328865456397)^vstupy!R111)*vstupy!R103*$I$5,0)","v":549},{"$f":"ROUND((((($C$5-$D$5)/(LN(($C$5-$E$5)/($D$5-$E$5))))/49.8328865456397)^vstupy!S111)*vstupy!S103*$I$5,0)","v":682},{"$f":"ROUND((((($C$5-$D$5)/(LN(($C$5-$E$5)/($D$5-$E$5))))/49.8328865456397)^vstupy!T111)*vstupy!T103*$I$5,0)","v":841},null,null,null,null,null,450,null,null,450,{"$f":"ROUND((vstupy!C103*POWER($F$5/50,vstupy!C111))*$I$5,0)","v":287},{"$f":"ROUND((vstupy!D103*POWER($F$5/50,vstupy!D111))*$I$5,0)","v":369},{"$f":"ROUND((vstupy!E103*POWER($F$5/50,vstupy!E111))*$I$5,0)","v":504},{"$f":"ROUND((vstupy!F103*POWER($F$5/50,vstupy!F111))*$I$5,0)","v":626},{"$f":"ROUND((vstupy!G103*POWER($F$5/50,vstupy!G111))*$I$5,0)","v":772},{"$f":"ROUND((vstupy!H103*POWER($F$5/50,vstupy!H111))*$I$5,0)","v":287},{"$f":"ROUND((vstupy!I103*POWER($F$5/50,vstupy!I111))*$I$5,0)","v":369},{"$f":"ROUND((vstupy!J103*POWER($F$5/50,vstupy!J111))*$I$5,0)","v":504},{"$f":"ROUND((vstupy!K103*POWER($F$5/50,vstupy!K111))*$I$5,0)","v":626},{"$f":"ROUND((vstupy!L103*POWER($F$5/50,vstupy!L111))*$I$5,0)","v":772},450,null,450,{"$f":"ROUND((vstupy!P103*POWER($F$5/50,vstupy!P111))*$I$5,0)","v":312},{"$f":"ROUND((vstupy!Q103*POWER($F$5/50,vstupy!Q111))*$I$5,0)","v":402},{"$f":"ROUND((vstupy!R103*POWER($F$5/50,vstupy!R111))*$I$5,0)","v":549},{"$f":"ROUND((vstupy!S103*POWER($F$5/50,vstupy!S111))*$I$5,0)","v":682},{"$f":"ROUND((vstupy!T103*POWER($F$5/50,vstupy!T111))*$I$5,0)","v":841},null,null,null,null,null,450]
[null,500,{"$f":"ROUND((((($C$5-$D$5)/(LN(($C$5-$E$5)/($D$5-$E$5))))/49.8328865456397)^vstupy!C112)*vstupy!C104*$I$5,0)","v":315},{"$f":"ROUND((((($C$5-$D$5)/(LN(($C$5-$E$5)/($D$5-$E$5))))/49.8328865456397)^vstupy!D112)*vstupy!D104*$I$5,0)","v":405},{"$f":"ROUND((((($C$5-$D$5)/(LN(($C$5-$E$5)/($D$5-$E$5))))/49.8328865456397)^vstupy!E112)*vstupy!E104*$I$5,0)","v":553},{"$f":"ROUND((((($C$5-$D$5)/(LN(($C$5-$E$5)/($D$5-$E$5))))/49.8328865456397)^vstupy!F112)*vstupy!F104*$I$5,0)","v":687},{"$f":"ROUND((((($C$5-$D$5)/(LN(($C$5-$E$5)/($D$5-$E$5))))/49.8328865456397)^vstupy!G112)*vstupy!G104*$I$5,0)","v":848},{"$f":"ROUND((((($C$5-$D$5)/(LN(($C$5-$E$5)/($D$5-$E$5))))/49.8328865456397)^vstupy!H112)*vstupy!H104*$I$5,0)","v":315},{"$f":"ROUND((((($C$5-$D$5)/(LN(($C$5-$E$5)/($D$5-$E$5))))/49.8328865456397)^vstupy!I112)*vstupy!I104*$I$5,0)","v":405},{"$f":"ROUND((((($C$5-$D$5)/(LN(($C$5-$E$5)/($D$5-$E$5))))/49.8328865456397)^vstupy!J112)*vstupy!J104*$I$5,0)","v":553},{"$f":"ROUND((((($C$5-$D$5)/(LN(($C$5-$E$5)/($D$5-$E$5))))/49.8328865456397)^vstupy!K112)*vstupy!K104*$I$5,0)","v":687},{"$f":"ROUND((((($C$5-$D$5)/(LN(($C$5-$E$5)/($D$5-$E$5))))/49.8328865456397)^vstupy!L112)*vstupy!L104*$I$5,0)","v":848},500,null,500,{"$f":"ROUND((((($C$5-$D$5)/(LN(($C$5-$E$5)/($D$5-$E$5))))/49.8328865456397)^vstupy!P112)*vstupy!P104*$I$5,0)","v":342},{"$f":"ROUND((((($C$5-$D$5)/(LN(($C$5-$E$5)/($D$5-$E$5))))/49.8328865456397)^vstupy!Q112)*vstupy!Q104*$I$5,0)","v":440},{"$f":"ROUND((((($C$5-$D$5)/(LN(($C$5-$E$5)/($D$5-$E$5))))/49.8328865456397)^vstupy!R112)*vstupy!R104*$I$5,0)","v":601},{"$f":"ROUND((((($C$5-$D$5)/(LN(($C$5-$E$5)/($D$5-$E$5))))/49.8328865456397)^vstupy!S112)*vstupy!S104*$I$5,0)","v":747},{"$f":"ROUND((((($C$5-$D$5)/(LN(($C$5-$E$5)/($D$5-$E$5))))/49.8328865456397)^vstupy!T112)*vstupy!T104*$I$5,0)","v":921},null,null,null,null,null,500,null,null,500,{"$f":"ROUND((vstupy!C104*POWER($F$5/50,vstupy!C112))*$I$5,0)","v":315},{"$f":"ROUND((vstupy!D104*POWER($F$5/50,vstupy!D112))*$I$5,0)","v":405},{"$f":"ROUND((vstupy!E104*POWER($F$5/50,vstupy!E112))*$I$5,0)","v":553},{"$f":"ROUND((vstupy!F104*POWER($F$5/50,vstupy!F112))*$I$5,0)","v":687},{"$f":"ROUND((vstupy!G104*POWER($F$5/50,vstupy!G112))*$I$5,0)","v":848},{"$f":"ROUND((vstupy!H104*POWER($F$5/50,vstupy!H112))*$I$5,0)","v":315},{"$f":"ROUND((vstupy!I104*POWER($F$5/50,vstupy!I112))*$I$5,0)","v":405},{"$f":"ROUND((vstupy!J104*POWER($F$5/50,vstupy!J112))*$I$5,0)","v":553},{"$f":"ROUND((vstupy!K104*POWER($F$5/50,vstupy!K112))*$I$5,0)","v":687},{"$f":"ROUND((vstupy!L104*POWER($F$5/50,vstupy!L112))*$I$5,0)","v":848},500,null,500,{"$f":"ROUND((vstupy!P104*POWER($F$5/50,vstupy!P112))*$I$5,0)","v":342},{"$f":"ROUND((vstupy!Q104*POWER($F$5/50,vstupy!Q112))*$I$5,0)","v":440},{"$f":"ROUND((vstupy!R104*POWER($F$5/50,vstupy!R112))*$I$5,0)","v":601},{"$f":"ROUND((vstupy!S104*POWER($F$5/50,vstupy!S112))*$I$5,0)","v":747},{"$f":"ROUND((vstupy!T104*POWER($F$5/50,vstupy!T112))*$I$5,0)","v":921},null,null,null,null,null,500]
[null,600,{"$f":"ROUND((((($C$5-$D$5)/(LN(($C$5-$E$5)/($D$5-$E$5))))/49.8328865456397)^vstupy!C113)*vstupy!C105*$I$5,0)","v":370},{"$f":"ROUND((((($C$5-$D$5)/(LN(($C$5-$E$5)/($D$5-$E$5))))/49.8328865456397)^vstupy!D113)*vstupy!D105*$I$5,0)","v":475},{"$f":"ROUND((((($C$5-$D$5)/(LN(($C$5-$E$5)/($D$5-$E$5))))/49.8328865456397)^vstupy!E113)*vstupy!E105*$I$5,0)","v":650},{"$f":"ROUND((((($C$5-$D$5)/(LN(($C$5-$E$5)/($D$5-$E$5))))/49.8328865456397)^vstupy!F113)*vstupy!F105*$I$5,0)","v":808},{"$f":"ROUND((((($C$5-$D$5)/(LN(($C$5-$E$5)/($D$5-$E$5))))/49.8328865456397)^vstupy!G113)*vstupy!G105*$I$5,0)","v":996},{"$f":"ROUND((((($C$5-$D$5)/(LN(($C$5-$E$5)/($D$5-$E$5))))/49.8328865456397)^vstupy!H113)*vstupy!H105*$I$5,0)","v":370},{"$f":"ROUND((((($C$5-$D$5)/(LN(($C$5-$E$5)/($D$5-$E$5))))/49.8328865456397)^vstupy!I113)*vstupy!I105*$I$5,0)","v":475},{"$f":"ROUND((((($C$5-$D$5)/(LN(($C$5-$E$5)/($D$5-$E$5))))/49.8328865456397)^vstupy!J113)*vstupy!J105*$I$5,0)","v":650},{"$f":"ROUND((((($C$5-$D$5)/(LN(($C$5-$E$5)/($D$5-$E$5))))/49.8328865456397)^vstupy!K113)*vstupy!K105*$I$5,0)","v":808},{"$f":"ROUND((((($C$5-$D$5)/(LN(($C$5-$E$5)/($D$5-$E$5))))/49.8328865456397)^vstupy!L113)*vstupy!L105*$I$5,0)","v":996},600,null,600,{"$f":"ROUND((((($C$5-$D$5)/(LN(($C$5-$E$5)/($D$5-$E$5))))/49.8328865456397)^vstupy!P113)*vstupy!P105*$I$5,0)","v":400},{"$f":"ROUND((((($C$5-$D$5)/(LN(($C$5-$E$5)/($D$5-$E$5))))/49.8328865456397)^vstupy!Q113)*vstupy!Q105*$I$5,0)","v":515},{"$f":"ROUND((((($C$5-$D$5)/(LN(($C$5-$E$5)/($D$5-$E$5))))/49.8328865456397)^vstupy!R113)*vstupy!R105*$I$5,0)","v":703},{"$f":"ROUND((((($C$5-$D$5)/(LN(($C$5-$E$5)/($D$5-$E$5))))/49.8328865456397)^vstupy!S113)*vstupy!S105*$I$5,0)","v":874},{"$f":"ROUND((((($C$5-$D$5)/(LN(($C$5-$E$5)/($D$5-$E$5))))/49.8328865456397)^vstupy!T113)*vstupy!T105*$I$5,0)","v":1078},null,null,null,null,null,600,null,null,600,{"$f":"ROUND((vstupy!C105*POWER($F$5/50,vstupy!C113))*$I$5,0)","v":370},{"$f":"ROUND((vstupy!D105*POWER($F$5/50,vstupy!D113))*$I$5,0)","v":475},{"$f":"ROUND((vstupy!E105*POWER($F$5/50,vstupy!E113))*$I$5,0)","v":650},{"$f":"ROUND((vstupy!F105*POWER($F$5/50,vstupy!F113))*$I$5,0)","v":808},{"$f":"ROUND((vstupy!G105*POWER($F$5/50,vstupy!G113))*$I$5,0)","v":996},{"$f":"ROUND((vstupy!H105*POWER($F$5/50,vstupy!H113))*$I$5,0)","v":370},{"$f":"ROUND((vstupy!I105*POWER($F$5/50,vstupy!I113))*$I$5,0)","v":475},{"$f":"ROUND((vstupy!J105*POWER($F$5/50,vstupy!J113))*$I$5,0)","v":650},{"$f":"ROUND((vstupy!K105*POWER($F$5/50,vstupy!K113))*$I$5,0)","v":808},{"$f":"ROUND((vstupy!L105*POWER($F$5/50,vstupy!L113))*$I$5,0)","v":996},600,null,600,{"$f":"ROUND((vstupy!P105*POWER($F$5/50,vstupy!P113))*$I$5,0)","v":400},{"$f":"ROUND((vstupy!Q105*POWER($F$5/50,vstupy!Q113))*$I$5,0)","v":515},{"$f":"ROUND((vstupy!R105*POWER($F$5/50,vstupy!R113))*$I$5,0)","v":703},{"$f":"ROUND((vstupy!S105*POWER($F$5/50,vstupy!S113))*$I$5,0)","v":874},{"$f":"ROUND((vstupy!T105*POWER($F$5/50,vstupy!T113))*$I$5,0)","v":1078},null,null,null,null,null,600]
[null,750,{"$f":"ROUND((((($C$5-$D$5)/(LN(($C$5-$E$5)/($D$5-$E$5))))/49.8328865456397)^vstupy!C114)*vstupy!C106*$I$5,0)","v":450},{"$f":"ROUND((((($C$5-$D$5)/(LN(($C$5-$E$5)/($D$5-$E$5))))/49.8328865456397)^vstupy!D114)*vstupy!D106*$I$5,0)","v":579},{"$f":"ROUND((((($C$5-$D$5)/(LN(($C$5-$E$5)/($D$5-$E$5))))/49.8328865456397)^vstupy!E114)*vstupy!E106*$I$5,0)","v":791},{"$f":"ROUND((((($C$5-$D$5)/(LN(($C$5-$E$5)/($D$5-$E$5))))/49.8328865456397)^vstupy!F114)*vstupy!F106*$I$5,0)","v":984},{"$f":"ROUND((((($C$5-$D$5)/(LN(($C$5-$E$5)/($D$5-$E$5))))/49.8328865456397)^vstupy!G114)*vstupy!G106*$I$5,0)","v":1213},{"$f":"ROUND((((($C$5-$D$5)/(LN(($C$5-$E$5)/($D$5-$E$5))))/49.8328865456397)^vstupy!H114)*vstupy!H106*$I$5,0)","v":450},{"$f":"ROUND((((($C$5-$D$5)/(LN(($C$5-$E$5)/($D$5-$E$5))))/49.8328865456397)^vstupy!I114)*vstupy!I106*$I$5,0)","v":579},{"$f":"ROUND((((($C$5-$D$5)/(LN(($C$5-$E$5)/($D$5-$E$5))))/49.8328865456397)^vstupy!J114)*vstupy!J106*$I$5,0)","v":791},{"$f":"ROUND((((($C$5-$D$5)/(LN(($C$5-$E$5)/($D$5-$E$5))))/49.8328865456397)^vstupy!K114)*vstupy!K106*$I$5,0)","v":984},{"$f":"ROUND((((($C$5-$D$5)/(LN(($C$5-$E$5)/($D$5-$E$5))))/49.8328865456397)^vstupy!L114)*vstupy!L106*$I$5,0)","v":1213},750,null,750,{"$f":"ROUND((((($C$5-$D$5)/(LN(($C$5-$E$5)/($D$5-$E$5))))/49.8328865456397)^vstupy!P114)*vstupy!P106*$I$5,0)","v":485},{"$f":"ROUND((((($C$5-$D$5)/(LN(($C$5-$E$5)/($D$5-$E$5))))/49.8328865456397)^vstupy!Q114)*vstupy!Q106*$I$5,0)","v":624},{"$f":"ROUND((((($C$5-$D$5)/(LN(($C$5-$E$5)/($D$5-$E$5))))/49.8328865456397)^vstupy!R114)*vstupy!R106*$I$5,0)","v":852},{"$f":"ROUND((((($C$5-$D$5)/(LN(($C$5-$E$5)/($D$5-$E$5))))/49.8328865456397)^vstupy!S114)*vstupy!S106*$I$5,0)","v":1060},{"$f":"ROUND((((($C$5-$D$5)/(LN(($C$5-$E$5)/($D$5-$E$5))))/49.8328865456397)^vstupy!T114)*vstupy!T106*$I$5,0)","v":1307},null,null,null,null,null,750,null,null,750,{"$f":"ROUND((vstupy!C106*POWER($F$5/50,vstupy!C114))*$I$5,0)","v":450},{"$f":"ROUND((vstupy!D106*POWER($F$5/50,vstupy!D114))*$I$5,0)","v":579},{"$f":"ROUND((vstupy!E106*POWER($F$5/50,vstupy!E114))*$I$5,0)","v":791},{"$f":"ROUND((vstupy!F106*POWER($F$5/50,vstupy!F114))*$I$5,0)","v":984},{"$f":"ROUND((vstupy!G106*POWER($F$5/50,vstupy!G114))*$I$5,0)","v":1213},{"$f":"ROUND((vstupy!H106*POWER($F$5/50,vstupy!H114))*$I$5,0)","v":450},{"$f":"ROUND((vstupy!I106*POWER($F$5/50,vstupy!I114))*$I$5,0)","v":579},{"$f":"ROUND((vstupy!J106*POWER($F$5/50,vstupy!J114))*$I$5,0)","v":791},{"$f":"ROUND((vstupy!K106*POWER($F$5/50,vstupy!K114))*$I$5,0)","v":984},{"$f":"ROUND((vstupy!L106*POWER($F$5/50,vstupy!L114))*$I$5,0)","v":1213},750,null,750,{"$f":"ROUND((vstupy!P106*POWER($F$5/50,vstupy!P114))*$I$5,0)","v":485},{"$f":"ROUND((vstupy!Q106*POWER($F$5/50,vstupy!Q114))*$I$5,0)","v":624},{"$f":"ROUND((vstupy!R106*POWER($F$5/50,vstupy!R114))*$I$5,0)","v":852},{"$f":"ROUND((vstupy!S106*POWER($F$5/50,vstupy!S114))*$I$5,0)","v":1060},{"$f":"ROUND((vstupy!T106*POWER($F$5/50,vstupy!T114))*$I$5,0)","v":1307},null,null,null,null,null,750]
[]
[null,null,"KORALUX RONDO CLASSIC",null,null,null,null,"KORALUX RONDO CLASSIC - M",null,null,null,null,null,null,null,"KORALUX RONDO CLASSIC",null,null,null,null,"KORALUX RONDO CLASSIC - M",null,null,null,null,null,null,null,null,"KORALUX RONDO CLASSIC",null,null,null,null,"KORALUX RONDO CLASSIC - M",null,null,null,null,null,null,null,"KORALUX RONDO CLASSIC",null,null,null,null,"KORALUX RONDO CLASSIC - M"]
[null,"Délka L","Výška H [mm]",null,null,null,null,"Výška H [mm]",null,null,null,null,"Délka L",null,"Délka L","Výška H [mm]",null,null,null,null,"Výška H [mm]",null,null,null,null,"Délka L",null,null,"Délka L","Výška H [mm]",null,null,null,null,"Výška H [mm]",null,null,null,null,"Délka L",null,"Délka L","Výška H [mm]",null,null,null,null,"Výška H [mm]",null,null,null,null,"Délka L"]
[null,"[mm]",700,900,1220,1500,1820,700,900,1220,1500,1820,"[mm]",null,"[mm]",700,900,1220,1500,1820,700,900,1220,1500,1820,"[mm]",null,null,"[mm]",700,900,1220,1500,1820,700,900,1220,1500,1820,"[mm]",null,"[mm]",700,900,1220,1500,1820,700,900,1220,1500,1820,"[mm]"]
[null,450,{"$f":"ROUND((((($C$5-$D$5)/(LN(($C$5-$E$5)/($D$5-$E$5))))/49.8328865456397)^vstupy!C127)*vstupy!C119*$I$5,0)","v":255},{"$f":"ROUND((((($C$5-$D$5)/(LN(($C$5-$E$5)/($D$5-$E$5))))/49.8328865456397)^vstupy!D127)*vstupy!D119*$I$5,0)","v":333},{"$f":"ROUND((((($C$5-$D$5)/(LN(($C$5-$E$5)/($D$5-$E$5))))/49.8328865456397)^vstupy!E127)*vstupy!E119*$I$5,0)","v":462},{"$f":"ROUND((((($C$5-$D$5)/(LN(($C$5-$E$5)/($D$5-$E$5))))/49.8328865456397)^vstupy!F127)*vstupy!F119*$I$5,0)","v":581},{"$f":"ROUND((((($C$5-$D$5)/(LN(($C$5-$E$5)/($D$5-$E$5))))/49.8328865456397)^vstupy!G127)*vstupy!G119*$I$5,0)","v":725},{"$f":"ROUND((((($C$5-$D$5)/(LN(($C$5-$E$5)/($D$5-$E$5))))/49.8328865456397)^vstupy!H127)*vstupy!H119*$I$5,0)","v":255},{"$f":"ROUND((((($C$5-$D$5)/(LN(($C$5-$E$5)/($D$5-$E$5))))/49.8328865456397)^vstupy!I127)*vstupy!I119*$I$5,0)","v":333},{"$f":"ROUND((((($C$5-$D$5)/(LN(($C$5-$E$5)/($D$5-$E$5))))/49.8328865456397)^vstupy!J127)*vstupy!J119*$I$5,0)","v":462},{"$f":"ROUND((((($C$5-$D$5)/(LN(($C$5-$E$5)/($D$5-$E$5))))/49.8328865456397)^vstupy!K127)*vstupy!K119*$I$5,0)","v":581},{"$f":"ROUND((((($C$5-$D$5)/(LN(($C$5-$E$5)/($D$5-$E$5))))/49.8328865456397)^vstupy!L127)*vstupy!L119*$I$5,0)","v":725},450,null,450,{"$f":"ROUND((((($C$5-$D$5)/(LN(($C$5-$E$5)/($D$5-$E$5))))/49.8328865456397)^vstupy!P127)*vstupy!P119*$I$5,0)","v":291},{"$f":"ROUND((((($C$5-$D$5)/(LN(($C$5-$E$5)/($D$5-$E$5))))/49.8328865456397)^vstupy!Q127)*vstupy!Q119*$I$5,0)","v":378},{"$f":"ROUND((((($C$5-$D$5)/(LN(($C$5-$E$5)/($D$5-$E$5))))/49.8328865456397)^vstupy!R127)*vstupy!R119*$I$5,0)","v":519},{"$f":"ROUND((((($C$5-$D$5)/(LN(($C$5-$E$5)/($D$5-$E$5))))/49.8328865456397)^vstupy!S127)*vstupy!S119*$I$5,0)","v":643},{"$f":"ROUND((((($C$5-$D$5)/(LN(($C$5-$E$5)/($D$5-$E$5))))/49.8328865456397)^vstupy!T127)*vstupy!T119*$I$5,0)","v":786},null,null,null,null,null,450,null,null,450,{"$f":"ROUND((vstupy!C119*POWER($F$5/50,vstupy!C127))*$I$5,0)","v":255},{"$f":"ROUND((vstupy!D119*POWER($F$5/50,vstupy!D127))*$I$5,0)","v":333},{"$f":"ROUND((vstupy!E119*POWER($F$5/50,vstupy!E127))*$I$5,0)","v":462},{"$f":"ROUND((vstupy!F119*POWER($F$5/50,vstupy!F127))*$I$5,0)","v":581},{"$f":"ROUND((vstupy!G119*POWER($F$5/50,vstupy!G127))*$I$5,0)","v":725},{"$f":"ROUND((vstupy!H119*POWER($F$5/50,vstupy!H127))*$I$5,0)","v":255},{"$f":"ROUND((vstupy!I119*POWER($F$5/50,vstupy!I127))*$I$5,0)","v":333},{"$f":"ROUND((vstupy!J119*POWER($F$5/50,vstupy!J127))*$I$5,0)","v":462},{"$f":"ROUND((vstupy!K119*POWER($F$5/50,vstupy!K127))*$I$5,0)","v":581},{"$f":"ROUND((vstupy!L119*POWER($F$5/50,vstupy!L127))*$I$5,0)","v":725},450,null,450,{"$f":"ROUND((vstupy!P119*POWER($F$5/50,vstupy!P127))*$I$5,0)","v":291},{"$f":"ROUND((vstupy!Q119*POWER($F$5/50,vstupy!Q127))*$I$5,0)","v":378},{"$f":"ROUND((vstupy!R119*POWER($F$5/50,vstupy!R127))*$I$5,0)","v":519},{"$f":"ROUND((vstupy!S119*POWER($F$5/50,vstupy!S127))*$I$5,0)","v":643},{"$f":"ROUND((vstupy!T119*POWER($F$5/50,vstupy!T127))*$I$5,0)","v":786},null,null,null,null,null,450]
[null,500,{"$f":"ROUND((((($C$5-$D$5)/(LN(($C$5-$E$5)/($D$5-$E$5))))/49.8328865456397)^vstupy!C128)*vstupy!C120*$I$5,0)","v":280},{"$f":"ROUND((((($C$5-$D$5)/(LN(($C$5-$E$5)/($D$5-$E$5))))/49.8328865456397)^vstupy!D128)*vstupy!D120*$I$5,0)","v":365},{"$f":"ROUND((((($C$5-$D$5)/(LN(($C$5-$E$5)/($D$5-$E$5))))/49.8328865456397)^vstupy!E128)*vstupy!E120*$I$5,0)","v":507},{"$f":"ROUND((((($C$5-$D$5)/(LN(($C$5-$E$5)/($D$5-$E$5))))/49.8328865456397)^vstupy!F128)*vstupy!F120*$I$5,0)","v":638},{"$f":"ROUND((((($C$5-$D$5)/(LN(($C$5-$E$5)/($D$5-$E$5))))/49.8328865456397)^vstupy!G128)*vstupy!G120*$I$5,0)","v":795},{"$f":"ROUND((((($C$5-$D$5)/(LN(($C$5-$E$5)/($D$5-$E$5))))/49.8328865456397)^vstupy!H128)*vstupy!H120*$I$5,0)","v":280},{"$f":"ROUND((((($C$5-$D$5)/(LN(($C$5-$E$5)/($D$5-$E$5))))/49.8328865456397)^vstupy!I128)*vstupy!I120*$I$5,0)","v":365},{"$f":"ROUND((((($C$5-$D$5)/(LN(($C$5-$E$5)/($D$5-$E$5))))/49.8328865456397)^vstupy!J128)*vstupy!J120*$I$5,0)","v":507},{"$f":"ROUND((((($C$5-$D$5)/(LN(($C$5-$E$5)/($D$5-$E$5))))/49.8328865456397)^vstupy!K128)*vstupy!K120*$I$5,0)","v":638},{"$f":"ROUND((((($C$5-$D$5)/(LN(($C$5-$E$5)/($D$5-$E$5))))/49.8328865456397)^vstupy!L128)*vstupy!L120*$I$5,0)","v":795},500,null,500,{"$f":"ROUND((((($C$5-$D$5)/(LN(($C$5-$E$5)/($D$5-$E$5))))/49.8328865456397)^vstupy!P129)*vstupy!P120*$I$5,0)","v":318},{"$f":"ROUND((((($C$5-$D$5)/(LN(($C$5-$E$5)/($D$5-$E$5))))/49.8328865456397)^vstupy!Q129)*vstupy!Q120*$I$5,0)","v":413},{"$f":"ROUND((((($C$5-$D$5)/(LN(($C$5-$E$5)/($D$5-$E$5))))/49.8328865456397)^vstupy!R129)*vstupy!R120*$I$5,0)","v":567},{"$f":"ROUND((((($C$5-$D$5)/(LN(($C$5-$E$5)/($D$5-$E$5))))/49.8328865456397)^vstupy!S129)*vstupy!S120*$I$5,0)","v":703},{"$f":"ROUND((((($C$5-$D$5)/(LN(($C$5-$E$5)/($D$5-$E$5))))/49.8328865456397)^vstupy!T129)*vstupy!T120*$I$5,0)","v":859},null,null,null,null,null,null,null,null,500,{"$f":"ROUND((vstupy!C120*POWER($F$5/50,vstupy!C128))*$I$5,0)","v":280},{"$f":"ROUND((vstupy!D120*POWER($F$5/50,vstupy!D128))*$I$5,0)","v":365},{"$f":"ROUND((vstupy!E120*POWER($F$5/50,vstupy!E128))*$I$5,0)","v":507},{"$f":"ROUND((vstupy!F120*POWER($F$5/50,vstupy!F128))*$I$5,0)","v":638},{"$f":"ROUND((vstupy!G120*POWER($F$5/50,vstupy!G128))*$I$5,0)","v":795},{"$f":"ROUND((vstupy!H120*POWER($F$5/50,vstupy!H128))*$I$5,0)","v":280},{"$f":"ROUND((vstupy!I120*POWER($F$5/50,vstupy!I128))*$I$5,0)","v":365},{"$f":"ROUND((vstupy!J120*POWER($F$5/50,vstupy!J128))*$I$5,0)","v":507},{"$f":"ROUND((vstupy!K120*POWER($F$5/50,vstupy!K128))*$I$5,0)","v":638},{"$f":"ROUND((vstupy!L120*POWER($F$5/50,vstupy!L128))*$I$5,0)","v":795},500,null,500,{"$f":"ROUND((vstupy!P120*POWER($F$5/50,vstupy!P128))*$I$5,0)","v":318},{"$f":"ROUND((vstupy!Q120*POWER($F$5/50,vstupy!Q128))*$I$5,0)","v":413},{"$f":"ROUND((vstupy!R120*POWER($F$5/50,vstupy!R128))*$I$5,0)","v":567},{"$f":"ROUND((vstupy!S120*POWER($F$5/50,vstupy!S128))*$I$5,0)","v":703},{"$f":"ROUND((vstupy!T120*POWER($F$5/50,vstupy!T128))*$I$5,0)","v":859},null,null,null,null,null,500]
[null,600,{"$f":"ROUND((((($C$5-$D$5)/(LN(($C$5-$E$5)/($D$5-$E$5))))/49.8328865456397)^vstupy!C129)*vstupy!C121*$I$5,0)","v":329},{"$f":"ROUND((((($C$5-$D$5)/(LN(($C$5-$E$5)/($D$5-$E$5))))/49.8328865456397)^vstupy!D129)*vstupy!D121*$I$5,0)","v":429},{"$f":"ROUND((((($C$5-$D$5)/(LN(($C$5-$E$5)/($D$5-$E$5))))/49.8328865456397)^vstupy!E129)*vstupy!E121*$I$5,0)","v":596},{"$f":"ROUND((((($C$5-$D$5)/(LN(($C$5-$E$5)/($D$5-$E$5))))/49.8328865456397)^vstupy!F129)*vstupy!F121*$I$5,0)","v":750},{"$f":"ROUND((((($C$5-$D$5)/(LN(($C$5-$E$5)/($D$5-$E$5))))/49.8328865456397)^vstupy!G129)*vstupy!G121*$I$5,0)","v":934},{"$f":"ROUND((((($C$5-$D$5)/(LN(($C$5-$E$5)/($D$5-$E$5))))/49.8328865456397)^vstupy!H129)*vstupy!H121*$I$5,0)","v":329},{"$f":"ROUND((((($C$5-$D$5)/(LN(($C$5-$E$5)/($D$5-$E$5))))/49.8328865456397)^vstupy!I129)*vstupy!I121*$I$5,0)","v":429},{"$f":"ROUND((((($C$5-$D$5)/(LN(($C$5-$E$5)/($D$5-$E$5))))/49.8328865456397)^vstupy!J129)*vstupy!J121*$I$5,0)","v":596},{"$f":"ROUND((((($C$5-$D$5)/(LN(($C$5-$E$5)/($D$5-$E$5))))/49.8328865456397)^vstupy!K129)*vstupy!K121*$I$5,0)","v":750},{"$f":"ROUND((((($C$5-$D$5)/(LN(($C$5-$E$5)/($D$5-$E$5))))/49.8328865456397)^vstupy!L129)*vstupy!L121*$I$5,0)","v":934},600,null,600,{"$f":"ROUND((((($C$5-$D$5)/(LN(($C$5-$E$5)/($D$5-$E$5))))/49.8328865456397)^vstupy!P130)*vstupy!P121*$I$5,0)","v":372},{"$f":"ROUND((((($C$5-$D$5)/(LN(($C$5-$E$5)/($D$5-$E$5))))/49.8328865456397)^vstupy!Q130)*vstupy!Q121*$I$5,0)","v":482},{"$f":"ROUND((((($C$5-$D$5)/(LN(($C$5-$E$5)/($D$5-$E$5))))/49.8328865456397)^vstupy!R130)*vstupy!R121*$I$5,0)","v":662},{"$f":"ROUND((((($C$5-$D$5)/(LN(($C$5-$E$5)/($D$5-$E$5))))/49.8328865456397)^vstupy!S130)*vstupy!S121*$I$5,0)","v":820},{"$f":"ROUND((((($C$5-$D$5)/(LN(($C$5-$E$5)/($D$5-$E$5))))/49.8328865456397)^vstupy!T130)*vstupy!T121*$I$5,0)","v":1003},null,null,null,null,null,600,null,null,600,{"$f":"ROUND((vstupy!C121*POWER($F$5/50,vstupy!C129))*$I$5,0)","v":329},{"$f":"ROUND((vstupy!D121*POWER($F$5/50,vstupy!D129))*$I$5,0)","v":429},{"$f":"ROUND((vstupy!E121*POWER($F$5/50,vstupy!E129))*$I$5,0)","v":596},{"$f":"ROUND((vstupy!F121*POWER($F$5/50,vstupy!F129))*$I$5,0)","v":750},{"$f":"ROUND((vstupy!G121*POWER($F$5/50,vstupy!G129))*$I$5,0)","v":934},{"$f":"ROUND((vstupy!H121*POWER($F$5/50,vstupy!H129))*$I$5,0)","v":329},{"$f":"ROUND((vstupy!I121*POWER($F$5/50,vstupy!I129))*$I$5,0)","v":429},{"$f":"ROUND((vstupy!J121*POWER($F$5/50,vstupy!J129))*$I$5,0)","v":596},{"$f":"ROUND((vstupy!K121*POWER($F$5/50,vstupy!K129))*$I$5,0)","v":750},{"$f":"ROUND((vstupy!L121*POWER($F$5/50,vstupy!L129))*$I$5,0)","v":934},600,null,600,{"$f":"ROUND((vstupy!P121*POWER($F$5/50,vstupy!P129))*$I$5,0)","v":372},{"$f":"ROUND((vstupy!Q121*POWER($F$5/50,vstupy!Q129))*$I$5,0)","v":482},{"$f":"ROUND((vstupy!R121*POWER($F$5/50,vstupy!R129))*$I$5,0)","v":662},{"$f":"ROUND((vstupy!S121*POWER($F$5/50,vstupy!S129))*$I$5,0)","v":820},{"$f":"ROUND((vstupy!T121*POWER($F$5/50,vstupy!T129))*$I$5,0)","v":1003},null,null,null,null,null,600]
[null,750,{"$f":"ROUND((((($C$5-$D$5)/(LN(($C$5-$E$5)/($D$5-$E$5))))/49.8328865456397)^vstupy!C130)*vstupy!C122*$I$5,0)","v":400},{"$f":"ROUND((((($C$5-$D$5)/(LN(($C$5-$E$5)/($D$5-$E$5))))/49.8328865456397)^vstupy!D130)*vstupy!D122*$I$5,0)","v":522},{"$f":"ROUND((((($C$5-$D$5)/(LN(($C$5-$E$5)/($D$5-$E$5))))/49.8328865456397)^vstupy!E130)*vstupy!E122*$I$5,0)","v":726},{"$f":"ROUND((((($C$5-$D$5)/(LN(($C$5-$E$5)/($D$5-$E$5))))/49.8328865456397)^vstupy!F130)*vstupy!F122*$I$5,0)","v":913},{"$f":"ROUND((((($C$5-$D$5)/(LN(($C$5-$E$5)/($D$5-$E$5))))/49.8328865456397)^vstupy!G130)*vstupy!G122*$I$5,0)","v":1138},{"$f":"ROUND((((($C$5-$D$5)/(LN(($C$5-$E$5)/($D$5-$E$5))))/49.8328865456397)^vstupy!H130)*vstupy!H122*$I$5,0)","v":400},{"$f":"ROUND((((($C$5-$D$5)/(LN(($C$5-$E$5)/($D$5-$E$5))))/49.8328865456397)^vstupy!I130)*vstupy!I122*$I$5,0)","v":522},{"$f":"ROUND((((($C$5-$D$5)/(LN(($C$5-$E$5)/($D$5-$E$5))))/49.8328865456397)^vstupy!J130)*vstupy!J122*$I$5,0)","v":726},{"$f":"ROUND((((($C$5-$D$5)/(LN(($C$5-$E$5)/($D$5-$E$5))))/49.8328865456397)^vstupy!K130)*vstupy!K122*$I$5,0)","v":913},{"$f":"ROUND((((($C$5-$D$5)/(LN(($C$5-$E$5)/($D$5-$E$5))))/49.8328865456397)^vstupy!L130)*vstupy!L122*$I$5,0)","v":1138},750,null,750,{"$f":"ROUND((((($C$5-$D$5)/(LN(($C$5-$E$5)/($D$5-$E$5))))/49.8328865456397)^vstupy!P130)*vstupy!P122*$I$5,0)","v":449},{"$f":"ROUND((((($C$5-$D$5)/(LN(($C$5-$E$5)/($D$5-$E$5))))/49.8328865456397)^vstupy!Q130)*vstupy!Q122*$I$5,0)","v":583},{"$f":"ROUND((((($C$5-$D$5)/(LN(($C$5-$E$5)/($D$5-$E$5))))/49.8328865456397)^vstupy!R130)*vstupy!R122*$I$5,0)","v":799},{"$f":"ROUND((((($C$5-$D$5)/(LN(($C$5-$E$5)/($D$5-$E$5))))/49.8328865456397)^vstupy!S130)*vstupy!S122*$I$5,0)","v":991},{"$f":"ROUND((((($C$5-$D$5)/(LN(($C$5-$E$5)/($D$5-$E$5))))/49.8328865456397)^vstupy!T130)*vstupy!T122*$I$5,0)","v":1211},null,null,null,null,null,750,null,null,750,{"$f":"ROUND((vstupy!C122*POWER($F$5/50,vstupy!C130))*$I$5,0)","v":400},{"$f":"ROUND((vstupy!D122*POWER($F$5/50,vstupy!D130))*$I$5,0)","v":522},{"$f":"ROUND((vstupy!E122*POWER($F$5/50,vstupy!E130))*$I$5,0)","v":726},{"$f":"ROUND((vstupy!F122*POWER($F$5/50,vstupy!F130))*$I$5,0)","v":913},{"$f":"ROUND((vstupy!G122*POWER($F$5/50,vstupy!G130))*$I$5,0)","v":1138},{"$f":"ROUND((vstupy!H122*POWER($F$5/50,vstupy!H130))*$I$5,0)","v":400},{"$f":"ROUND((vstupy!I122*POWER($F$5/50,vstupy!I130))*$I$5,0)","v":522},{"$f":"ROUND((vstupy!J122*POWER($F$5/50,vstupy!J130))*$I$5,0)","v":726},{"$f":"ROUND((vstupy!K122*POWER($F$5/50,vstupy!K130))*$I$5,0)","v":913},{"$f":"ROUND((vstupy!L122*POWER($F$5/50,vstupy!L130))*$I$5,0)","v":1138},750,null,750,{"$f":"ROUND((vstupy!P122*POWER($F$5/50,vstupy!P130))*$I$5,0)","v":449},{"$f":"ROUND((vstupy!Q122*POWER($F$5/50,vstupy!Q130))*$I$5,0)","v":583},{"$f":"ROUND((vstupy!R122*POWER($F$5/50,vstupy!R130))*$I$5,0)","v":799},{"$f":"ROUND((vstupy!S122*POWER($F$5/50,vstupy!S130))*$I$5,0)","v":991},{"$f":"ROUND((vstupy!T122*POWER($F$5/50,vstupy!T130))*$I$5,0)","v":1211},null,null,null,null,null,750]
[]
[null,null,"KORALUX RONDO EXCLUSIVE - M",null,null,null,null,null,null,null,null,null,null,null,null,"KORALUX RONDO EXCLUSIVE - M",null,null,null,null,null,null,null,null,null,null,null,null,null,"KORALUX RONDO EXCLUSIVE - M",null,null,null,null,null,null,null,null,null,null,null,null,"KORALUX RONDO EXCLUSIVE - M"]
[null,"Délka L","Výška H [mm]",null,null,null,null,null,null,null,null,null,null,null,"Délka L","Výška H [mm]",null,null,null,null,null,null,null,null,null,null,null,null,"Délka L","Výška H [mm]",null,null,null,null,null,null,null,null,null,null,null,"Délka L","Výška H [mm]"]
[null,"[mm]",900,1220,1500,1820,null,null,null,null,null,null,null,null,"[mm]",900,1220,1500,1820,null,null,null,null,null,null,null,null,null,"[mm]",900,1220,1500,1820,null,null,null,null,null,null,null,null,"[mm]",900,1220,1500,1820]
[null,450,{"$f":"ROUND((((($C$5-$D$5)/(LN(($C$5-$E$5)/($D$5-$E$5))))/49.8328865456397)^vstupy!C142)*vstupy!C135*$I$5,0)","v":249},{"$f":"ROUND((((($C$5-$D$5)/(LN(($C$5-$E$5)/($D$5-$E$5))))/49.8328865456397)^vstupy!D142)*vstupy!D135*$I$5,0)","v":338},{"$f":"ROUND((((($C$5-$D$5)/(LN(($C$5-$E$5)/($D$5-$E$5))))/49.8328865456397)^vstupy!E142)*vstupy!E135*$I$5,0)","v":419},{"$f":"ROUND((((($C$5-$D$5)/(LN(($C$5-$E$5)/($D$5-$E$5))))/49.8328865456397)^vstupy!F142)*vstupy!F135*$I$5,0)","v":516},null,null,null,null,null,null,null,null,450,null,null,null,null,null,null,null,null,null,null,null,null,null,450,{"$f":"ROUND((vstupy!C135*POWER($F$5/50,vstupy!C142))*$I$5,0)","v":249},{"$f":"ROUND((vstupy!D135*POWER($F$5/50,vstupy!D142))*$I$5,0)","v":338},{"$f":"ROUND((vstupy!E135*POWER($F$5/50,vstupy!E142))*$I$5,0)","v":419},{"$f":"ROUND((vstupy!F135*POWER($F$5/50,vstupy!F142))*$I$5,0)","v":516},null,null,null,null,null,null,null,null,450]
[null,600,{"$f":"ROUND((((($C$5-$D$5)/(LN(($C$5-$E$5)/($D$5-$E$5))))/49.8328865456397)^vstupy!C143)*vstupy!C136*$I$5,0)","v":319},{"$f":"ROUND((((($C$5-$D$5)/(LN(($C$5-$E$5)/($D$5-$E$5))))/49.8328865456397)^vstupy!D143)*vstupy!D136*$I$5,0)","v":433},{"$f":"ROUND((((($C$5-$D$5)/(LN(($C$5-$E$5)/($D$5-$E$5))))/49.8328865456397)^vstupy!E143)*vstupy!E136*$I$5,0)","v":537},{"$f":"ROUND((((($C$5-$D$5)/(LN(($C$5-$E$5)/($D$5-$E$5))))/49.8328865456397)^vstupy!F143)*vstupy!F136*$I$5,0)","v":662},null,null,null,null,null,null,null,null,600,null,null,null,null,null,null,null,null,null,null,null,null,null,600,{"$f":"ROUND((vstupy!C136*POWER($F$5/50,vstupy!C143))*$I$5,0)","v":319},{"$f":"ROUND((vstupy!D136*POWER($F$5/50,vstupy!D143))*$I$5,0)","v":433},{"$f":"ROUND((vstupy!E136*POWER($F$5/50,vstupy!E143))*$I$5,0)","v":537},{"$f":"ROUND((vstupy!F136*POWER($F$5/50,vstupy!F143))*$I$5,0)","v":662},null,null,null,null,null,null,null,null,600]
[null,750,{"$f":"ROUND((((($C$5-$D$5)/(LN(($C$5-$E$5)/($D$5-$E$5))))/49.8328865456397)^vstupy!C144)*vstupy!C137*$I$5,0)","v":387},{"$f":"ROUND((((($C$5-$D$5)/(LN(($C$5-$E$5)/($D$5-$E$5))))/49.8328865456397)^vstupy!D144)*vstupy!D137*$I$5,0)","v":526},{"$f":"ROUND((((($C$5-$D$5)/(LN(($C$5-$E$5)/($D$5-$E$5))))/49.8328865456397)^vstupy!E144)*vstupy!E137*$I$5,0)","v":652},{"$f":"ROUND((((($C$5-$D$5)/(LN(($C$5-$E$5)/($D$5-$E$5))))/49.8328865456397)^vstupy!F144)*vstupy!F137*$I$5,0)","v":802},null,null,null,null,null,null,null,null,750,null,null,null,null,null,null,null,null,null,null,null,null,null,750,{"$f":"ROUND((vstupy!C137*POWER($F$5/50,vstupy!C144))*$I$5,0)","v":387},{"$f":"ROUND((vstupy!D137*POWER($F$5/50,vstupy!D144))*$I$5,0)","v":526},{"$f":"ROUND((vstupy!E137*POWER($F$5/50,vstupy!E144))*$I$5,0)","v":652},{"$f":"ROUND((vstupy!F137*POWER($F$5/50,vstupy!F144))*$I$5,0)","v":802},null,null,null,null,null,null,null,null,750]

{"sheet":"vstupy","index":3,"n_rows":227,"n_cols":26,"rows_kept":227,"cut":false,"hidden":true,"merged":[]}
[]
[]
[]
[]
[]
[]
[]
[]
[]
[]
[null,null,"VÝKONY PRO ZAPOJENÍ ZDOLA DOLŮ",null,null,null,null,null,null,null,null,null,null,null,"VÝKONY PRO ÚHLOPŘÍČNÉ ZAPOJENÍ"]
[null,null,"KORALUX LINEAR MAX",null,null,null,null,"KORALUX LINEAR MAX - M",null,null,null,null,null,null,null,"KORALUX LINEAR MAX",null,null,null,null,"KORALUX LINEAR MAX - M"]
[null,"Délka L","Výška H [mm]",null,null,null,null,"Výška H [mm]",null,null,null,null,"Délka L",null,"Délka L","Výška H [mm]",null,null,null,null,"Výška H [mm]",null,null,null,null,"Délka L"]
[null,"[mm]",700,900,1220,1500,1820,700,900,1220,1500,1820,"[mm]",null,"[mm]",700,900,1220,1500,1820,700,900,1220,1500,1820,"[mm]"]
[null,450,320,411,557,686,833,320,411,557,686,833,450,null,450,341,436,592,735,906,null,null,null,null,null,450]
[null,600,422,543,736,906,1101,422,543,736,906,1101,600,null,600,454,580,789,979,1206,null,null,null,null,null,600]
[null,750,524,673,913,1124,1367,524,673,913,1124,1367,750,null,750,567,725,985,1222,1507,null,null,null,null,null,750]
[]
[null,null,"KORALUX LINEAR MAX",null,null,null,null,"KORALUX LINEAR MAX - M",null,null,null,null,null,null,null,"KORALUX LINEAR MAX",null,null,null,null,"KORALUX LINEAR MAX - M"]
[null,"Délka L","Výška H [mm]",null,null,null,null,"Výška H [mm]",null,null,null,null,"Délka L",null,"Délka L","Výška H [mm]",null,null,null,null,"Výška H [mm]",null,null,null,null,"Délka L"]
[null,"[mm]",700,900,1220,1500,1820,700,900,1220,1500,1820,"[mm]",null,"[mm]",700,900,1220,1500,1820,700,900,1220,1500,1820,"[mm]"]
[null,450,1.2363,1.2464999999999999,1.2626999999999999,1.2688999999999999,1.276,1.2363,1.2464999999999999,1.2626999999999999,1.2688999999999999,1.276,450,null,450,1.2765,1.2816000000000001,1.2896000000000001,1.2967,1.3048]
[null,600,1.2476,1.256,1.2695000000000001,1.2646999999999999,1.2592000000000001,1.2476,1.256,1.2695000000000001,1.2646999999999999,1.2592000000000001,600,null,600,1.2650999999999999,1.2694000000000001,1.2762,1.2821,1.2889999999999999]
[null,750,1.2587999999999999,1.2655000000000001,1.2762,1.2604,1.2423999999999999,1.2587999999999999,1.2655000000000001,1.2762,1.2604,1.2423999999999999,750,null,750,1.2537,1.2572000000000001,1.2626999999999999,1.2676000000000001,1.2730999999999999,null,null,null,null,null,750]
[]
[null,null,"KORALUX LINEAR COMFORT",null,null,null,null,"KORALUX LINEAR COMFORT - M",null,null,null,null,null,null,null,"KORALUX LINEAR COMFORT",null,null,null,null,"KORALUX LINEAR COMFORT - M"]
[null,"Délka L","Výška H [mm]",null,null,null,null,"Výška H [mm]",null,null,null,null,"Délka L",null,"Délka L","Výška H [mm]",null,null,null,null,"Výška H [mm]",null,null,null,null,"Délka L"]
[null,"[mm]",700,900,1220,1500,1820,700,900,1220,1500,1820,"[mm]",null,"[mm]",700,900,1220,1500,1820,700,900,1220,1500,1820,"[mm]"]
[null,450,287,369,504,626,772,287,369,504,626,772,450,null,450,312,402,549,682,841,null,null,null,null,null,450]
[null,500,315,405,553,687,848,315,405,553,687,848,500,null,500,342,440,601,747,921,null,null,null,null,null,500]
[null,600,370,475,650,808,996,370,475,650,808,996,600,null,600,400,515,703,874,1078,null,null,null,null,null,600]
[null,750,450,579,791,984,1213,450,579,791,984,1213,750,null,750,485,624,852,1060,1307,null,null,null,null,null,750]
[]
[null,null,"KORALUX LINEAR COMFORT",null,null,null,null,"KORALUX LINEAR COMFORT - M",null,null,null,null,null,null,null,"KORALUX LINEAR COMFORT",null,null,null,null,"KORALUX LINEAR COMFORT - M"]
[null,"Délka L","Výška H [mm]",null,null,null,null,"Výška H [mm]",null,null,null,null,"Délka L",null,"Délka L","Výška H [mm]",null,null,null,null,"Výška H [mm]",null,null,null,null,"Délka L"]
[null,"[mm]",700,900,1220,1500,1820,700,900,1220,1500,1820,"[mm]",null,"[mm]",700,900,1220,1500,1820,700,900,1220,1500,1820,"[mm]"]
[null,450,1.2452000000000001,1.2488999999999999,1.2548999999999999,1.2588999999999999,1.2634000000000001,1.2452000000000001,1.2488999999999999,1.2548999999999999,1.2588999999999999,1.2634000000000001,450,null,450,1.2638,1.2699,1.2797000000000001,1.2883,1.2981,null,null,null,null,null,450]
[null,500,1.2421,1.2463,1.2532000000000001,1.2573000000000001,1.2621,1.2421,1.2463,1.2532000000000001,1.2573000000000001,1.2621,500,null,500,1.2543,1.2621,1.2744,1.2853000000000001,1.2976000000000001,null,null,null,null,null,500]
[null,600,1.2358,1.2412000000000001,1.2499,1.2543,1.2594000000000001,1.2358,1.2412000000000001,1.2499,1.2543,1.2594000000000001,600,null,600,1.2354000000000001,1.2463,1.2638,1.2791999999999999,1.2967,null,null,null,null,null,600]
[null,750,1.2262999999999999,1.2334000000000001,1.2447999999999999,1.2497,1.2553000000000001,1.2262999999999999,1.2334000000000001,1.2447999999999999,1.2497,1.2553000000000001,750,null,750,1.2069000000000001,1.2226999999999999,1.2479,1.27,1.2952999999999999,null,null,null,null,null,750]
[]
[null,null,"KORALUX LINEAR CLASSIC",null,null,null,null,"KORALUX LINEAR CLASSIC - M",null,null,null,null,null,null,null,"KORALUX LINEAR CLASSIC",null,null,null,null,"KORALUX LINEAR CLASSIC - M"]
[null,"Délka L","Výška H [mm]",null,null,null,null,"Výška H [mm]",null,null,null,null,"Délka L",null,"Délka L","Výška H [mm]",null,null,null,null,"Výška H [mm]",null,null,null,null,"Délka L"]
[null,"[mm]",{"$f":"logic!$L$4","v":"Długość"},900,1220,1500,1820,700,900,1220,1500,1820,"[mm]",null,"[mm]",700,900,1220,1500,1820,700,900,1220,1500,1820,"[mm]"]
[null,450,{"$f":"IF(logic!$D$98=1,C164,C200)","v":255},{"$f":"IF(logic!$D$98=1,D164,D200)","v":333},{"$f":"IF(logic!$D$98=1,E164,E200)","v":462},{"$f":"IF(logic!$D$98=1,F164,F200)","v":581},{"$f":"IF(logic!$D$98=1,G164,G200)","v":725},{"$f":"IF(logic!$D$98=1,H164,H200)","v":255},{"$f":"IF(logic!$D$98=1,I164,I200)","v":333},{"$f":"IF(logic!$D$98=1,J164,J200)","v":462},{"$f":"IF(logic!$D$98=1,K164,K200)","v":581},{"$f":"IF(logic!$D$98=1,L164,L200)","v":725},450,null,450,291,378,519,643,786,null,null,null,null,null,450]
[null,500,{"$f":"IF(logic!$D$98=1,C165,C201)","v":280},{"$f":"IF(logic!$D$98=1,D165,D201)","v":365},{"$f":"IF(logic!$D$98=1,E165,E201)","v":507},{"$f":"IF(logic!$D$98=1,F165,F201)","v":638},{"$f":"IF(logic!$D$98=1,G165,G201)","v":795},{"$f":"IF(logic!$D$98=1,H165,H201)","v":280},{"$f":"IF(logic!$D$98=1,I165,I201)","v":365},{"$f":"IF(logic!$D$98=1,J165,J201)","v":507},{"$f":"IF(logic!$D$98=1,K165,K201)","v":638},{"$f":"IF(logic!$D$98=1,L165,L201)","v":795},500,null,500,318,413,567,703,859,null,null,null,null,null,500]
[null,600,{"$f":"IF(logic!$D$98=1,C166,C202)","v":329},{"$f":"IF(logic!$D$98=1,D166,D202)","v":429},{"$f":"IF(logic!$D$98=1,E166,E202)","v":596},{"$f":"IF(logic!$D$98=1,F166,F202)","v":750},{"$f":"IF(logic!$D$98=1,G166,G202)","v":934},{"$f":"IF(logic!$D$98=1,H166,H202)","v":329},{"$f":"IF(logic!$D$98=1,I166,I202)","v":429},{"$f":"IF(logic!$D$98=1,J166,J202)","v":596},{"$f":"IF(logic!$D$98=1,K166,K202)","v":750},{"$f":"IF(logic!$D$98=1,L166,L202)","v":934},600,null,600,372,482,662,820,1003,null,null,null,null,null,600]
[null,750,{"$f":"IF(logic!$D$98=1,C167,C203)","v":400},{"$f":"IF(logic!$D$98=1,D167,D203)","v":522},{"$f":"IF(logic!$D$98=1,E167,E203)","v":726},{"$f":"IF(logic!$D$98=1,F167,F203)","v":913},{"$f":"IF(logic!$D$98=1,G167,G203)","v":1138},{"$f":"IF(logic!$D$98=1,H167,H203)","v":400},{"$f":"IF(logic!$D$98=1,I167,I203)","v":522},{"$f":"IF(logic!$D$98=1,J167,J203)","v":726},{"$f":"IF(logic!$D$98=1,K167,K203)","v":913},{"$f":"IF(logic!$D$98=1,L167,L203)","v":1138},750,null,750,449,583,799,991,1211,null,null,null,null,null,750]
[]
[null,null,"KORALUX LINEAR CLASSIC",null,null,null,null,"KORALUX LINEAR CLASSIC - M",null,null,null,null,null,null,null,"KORALUX LINEAR CLASSIC",null,null,null,null,"KORALUX LINEAR CLASSIC - M"]
[null,"Délka L","Výška H [mm]",null,null,null,null,"Výška H [mm]",null,null,null,null,"Délka L",null,"Délka L","Výška H [mm]",null,null,null,null,"Výška H [mm]",null,null,null,null,"Délka L"]
[null,"[mm]",700,900,1220,1500,1820,700,900,1220,1500,1820,"[mm]",null,"[mm]",700,900,1220,1500,1820,700,900,1220,1500,1820,"[mm]"]
[null,450,{"$f":"IF(logic!$D$98=1,C172,C208)","v":1.2225999999999999},{"$f":"IF(logic!$D$98=1,D172,D208)","v":1.2358},{"$f":"IF(logic!$D$98=1,E172,E208)","v":1.2567999999999999},{"$f":"IF(logic!$D$98=1,F172,F208)","v":1.2521},{"$f":"IF(logic!$D$98=1,G172,G208)","v":1.2421},{"$f":"IF(logic!$D$98=1,H172,H208)","v":1.2225999999999999},{"$f":"IF(logic!$D$98=1,I172,I208)","v":1.2358},{"$f":"IF(logic!$D$98=1,J172,J208)","v":1.2567999999999999},{"$f":"IF(logic!$D$98=1,K172,K208)","v":1.2521},{"$f":"IF(logic!$D$98=1,L172,L208)","v":1.2421},450,null,450,1.2765,1.2783,1.2810999999999999,1.2836000000000001,1.2864,null,null,null,null,null,450]
[null,500,{"$f":"IF(logic!$D$98=1,C173,C209)","v":1.2225999999999999},{"$f":"IF(logic!$D$98=1,D173,D209)","v":1.2346999999999999},{"$f":"IF(logic!$D$98=1,E173,E209)","v":1.254},{"$f":"IF(logic!$D$98=1,F173,F209)","v":1.2483},{"$f":"IF(logic!$D$98=1,G173,G209)","v":1.2393000000000001},{"$f":"IF(logic!$D$98=1,H173,H209)","v":1.2225999999999999},{"$f":"IF(logic!$D$98=1,I173,I209)","v":1.2346999999999999},{"$f":"IF(logic!$D$98=1,J173,J209)","v":1.254},{"$f":"IF(logic!$D$98=1,K173,K209)","v":1.2483},{"$f":"IF(logic!$D$98=1,L173,L209)","v":1.2393000000000001},500,null,500,1.2655000000000001,1.2690999999999999,1.2748999999999999,1.28,1.2859,null,null,null,null,null,500]
[null,600,{"$f":"IF(logic!$D$98=1,C174,C210)","v":1.2224999999999999},{"$f":"IF(logic!$D$98=1,D174,D210)","v":1.2324999999999999},{"$f":"IF(logic!$D$98=1,E174,E210)","v":1.2484},{"$f":"IF(logic!$D$98=1,F174,F210)","v":1.2407999999999999},{"$f":"IF(logic!$D$98=1,G174,G210)","v":1.2337},{"$f":"IF(logic!$D$98=1,H174,H210)","v":1.2224999999999999},{"$f":"IF(logic!$D$98=1,I174,I210)","v":1.2324999999999999},{"$f":"IF(logic!$D$98=1,J174,J210)","v":1.2484},{"$f":"IF(logic!$D$98=1,K174,K210)","v":1.2407999999999999},{"$f":"IF(logic!$D$98=1,L174,L210)","v":1.2337},600,null,600,1.2435,1.2508999999999999,1.2626999999999999,1.2729999999999999,1.2847999999999999,null,null,null,null,null,600]
[null,750,{"$f":"IF(logic!$D$98=1,C175,C211)","v":1.2223999999999999},{"$f":"IF(logic!$D$98=1,D175,D211)","v":1.2292000000000001},{"$f":"IF(logic!$D$98=1,E175,E211)","v":1.24},{"$f":"IF(logic!$D$98=1,F175,F211)","v":1.2294},{"$f":"IF(logic!$D$98=1,G175,G211)","v":1.2252000000000001},{"$f":"IF(logic!$D$98=1,H175,H211)","v":1.2223999999999999},{"$f":"IF(logic!$D$98=1,I175,I211)","v":1.2292000000000001},{"$f":"IF(logic!$D$98=1,J175,J211)","v":1.24},{"$f":"IF(logic!$D$98=1,K175,K211)","v":1.2294},{"$f":"IF(logic!$D$98=1,L175,L211)","v":1.2252000000000001},750,null,750,1.2104999999999999,1.2235,1.2442,1.2624,1.2830999999999999,null,null,null,null,null,750]
[]
[null,null,"KORALUX STANDARD",null,null,null,null,null,null,null,null,null,null,null,null,"KORALUX STANDARD"]
[null,"Délka L","Výška H [mm]",null,null,null,null,null,null,null,null,null,null,null,"Délka L","Výška H [mm]"]
[null,"[mm]",700,900,1220,1500,null,null,null,null,null,null,null,null,"[mm]",700,900,1220,1500]
[null,400,198,254,345,427,null,null,null,null,null,null,null,null,400,213,275,373,458]
[null,500,231,297,403,499,null,null,null,null,null,null,null,null,500,249,322,436,536]
[null,600,263,337,458,567,null,null,null,null,null,null,null,null,600,283,365,496,609]
[]
[null,null,"KORALUX STANDARD",null,null,null,null,null,null,null,null,null,null,null,null,"KORALUX STANDARD"]
[null,"Délka L","Výška H [mm]",null,null,null,null,null,null,null,null,null,null,null,"Délka L","Výška H [mm]"]
[null,"[mm]",700,900,1220,1500,null,null,null,null,null,null,null,null,"[mm]",700,900,1220,1500]
[null,400,1.2346999999999999,1.2153,1.2274,1.2423,null,null,null,null,null,null,null,null,400,1.2674000000000001,1.2364999999999999,1.2274,1.264]
[null,500,1.2278,1.2219,1.2341,1.2456,null,null,null,null,null,null,null,null,500,1.2616000000000001,1.2432000000000001,1.2341,1.2567999999999999]
[null,600,1.2209000000000001,1.2284999999999999,1.2406999999999999,1.2488999999999999,null,null,null,null,null,null,null,null,600,1.2557,1.2499,1.2406999999999999,1.2532000000000001]
[]
[null,null,"KORALUX LINEAR EXCLUSIVE - M",null,null,null,null,null,null,null,null,null,null,null,null,"KORALUX LINEAR EXCLUSIVE - M"]
[null,"Délka L","Výška H [mm]",null,null,null,null,null,null,null,null,null,null,null,"Délka L","Výška H [mm]"]
[null,"[mm]",900,1220,1500,1820,null,null,null,null,null,null,null,null,"[mm]",900,1220,1500,1820]
[null,450,249,338,419,516,null,null,null,null,null,null,null,null,450]
[null,600,319,433,537,662,null,null,null,null,null,null,null,null,600]
[null,750,387,526,652,802,null,null,null,null,null,null,null,null,750]
[]
[null,null,"KORALUX LINEAR EXCLUSIVE - M",null,null,null,null,null,null,null,null,null,null,null,null,"KORALUX LINEAR EXCLUSIVE - M"]
[null,"Délka L","Výška H [mm]",null,null,null,null,null,null,null,null,null,null,null,"Délka L","Výška H [mm]"]
[null,"[mm]",900,1220,1500,1820,null,null,null,null,null,null,null,null,"[mm]",900,1220,1500,1820]
[null,450,1.2519,1.2768999999999999,1.266,1.2625,null,null,null,null,null,null,null,null,450]
[null,600,1.2522,1.2709999999999999,1.2606999999999999,1.2563,null,null,null,null,null,null,null,null,600]
[null,750,1.2525999999999999,1.2649999999999999,1.2553000000000001,1.25,null,null,null,null,null,null,null,null,750]
[]
[null,null,"KORALUX RONDO MAX",null,null,null,null,"KORALUX RONDO MAX - M",null,null,null,null,null,null,null,"KORALUX RONDO MAX",null,null,null,null,"KORALUX RONDO MAX - M"]
[null,"Délka L","Výška H [mm]",null,null,null,null,"Výška H [mm]",null,null,null,null,"Délka L",null,"Délka L","Výška H [mm]",null,null,null,null,"Výška H [mm]",null,null,null,null,"Délka L"]
[null,"[mm]",700,900,1220,1500,1820,700,900,1220,1500,1820,"[mm]",null,"[mm]",700,900,1220,1500,1820,700,900,1220,1500,1820,"[mm]"]
[null,450,335,432,589,725,879,335,432,589,725,879,450,null,450,361,462,625,771,942,null,null,null,null,null,450]
[null,600,444,574,781,962,1166,444,574,781,962,1166,600,null,600,480,614,832,1026,1253,null,null,null,null,null,600]
[null,750,553,714,973,1197,1452,553,714,973,1197,1452,750,null,750,599,767,1038,1280,1564,null,null,null,null,null,750]
[]
[null,null,"KORALUX RONDO MAX",null,null,null,null,"KORALUX RONDO MAX - M",null,null,null,null,null,null,null,"KORALUX RONDO MAX",null,null,null,null,"KORALUX RONDO MAX - M"]
[null,"Délka L","Výška H [mm]",null,null,null,null,"Výška H [mm]",null,null,null,null,"Délka L",null,"Délka L","Výška H [mm]",null,null,null,null,"Výška H [mm]",null,null,null,null,"Délka L"]
[null,"[mm]",700,900,1220,1500,1820,700,900,1220,1500,1820,"[mm]",null,"[mm]",700,900,1220,1500,1820,700,900,1220,1500,1820,"[mm]"]
[null,450,1.2322,1.2336,1.2357,1.2376,1.2398,1.2322,1.2336,1.2357,1.2376,1.2398,450,null,450,1.266,1.2674000000000001,1.2697000000000001,1.2717000000000001,1.274,null,null,null,null,null,450]
[null,600,1.2279,1.2343,1.2445999999999999,1.2383999999999999,1.2314000000000001,1.2279,1.2343,1.2445999999999999,1.2383999999999999,1.2314000000000001,600,null,600,1.2554000000000001,1.2567999999999999,1.2591000000000001,1.2611000000000001,1.2634000000000001,null,null,null,null,null,600]
[null,750,1.2235,1.2350000000000001,1.2534000000000001,1.2392000000000001,1.2229000000000001,1.2235,1.2350000000000001,1.2534000000000001,1.2392000000000001,1.2229000000000001,750,null,750,1.2447999999999999,1.2462,1.2484999999999999,1.2504999999999999,1.2527999999999999,null,null,null,null,null,750]
[]
[null,null,"KORALUX RONDO COMFORT",null,null,null,null,"KORALUX RONDO COMFORT - M",null,null,null,null,null,null,null,"KORALUX RONDO COMFORT",null,null,null,null,"KORALUX RONDO COMFORT - M"]
[null,"Délka L","Výška H [mm]",null,null,null,null,"Výška H [mm]",null,null,null,null,"Délka L",null,"Délka L","Výška H [mm]",null,null,null,null,"Výška H [mm]",null,null,null,null,"Délka L"]
[null,"[mm]",700,900,1220,1500,1820,700,900,1220,1500,1820,"[mm]",null,"[mm]",700,900,1220,1500,1820,700,900,1220,1500,1820,"[mm]"]
[null,450,287,369,504,626,772,287,369,504,626,772,450,null,450,312,402,549,682,841,null,null,null,null,null,450]
[null,500,315,405,553,687,848,315,405,553,687,848,500,null,500,342,440,601,747,921,null,null,null,null,null,500]
[null,600,370,475,650,808,996,370,475,650,808,996,600,null,600,400,515,703,874,1078,null,null,null,null,null,600]
[null,750,450,579,791,984,1213,450,579,791,984,1213,750,null,750,485,624,852,1060,1307,null,null,null,null,null,750]
[]
[null,null,"KORALUX RONDO COMFORT",null,null,null,null,"KORALUX RONDO COMFORT - M",null,null,null,null,null,null,null,"KORALUX RONDO COMFORT",null,null,null,null,"KORALUX RONDO COMFORT - M"]
[null,"Délka L","Výška H [mm]",null,null,null,null,"Výška H [mm]",null,null,null,null,"Délka L",null,"Délka L","Výška H [mm]",null,null,null,null,"Výška H [mm]",null,null,null,null,"Délka L"]
[null,"[mm]",700,900,1220,1500,1820,700,900,1220,1500,1820,"[mm]",null,"[mm]",700,900,1220,1500,1820,700,900,1220,1500,1820,"[mm]"]
[null,450,1.2452000000000001,1.2488999999999999,1.2548999999999999,1.2588999999999999,1.2634000000000001,1.2452000000000001,1.2488999999999999,1.2548999999999999,1.2588999999999999,1.2634000000000001,450,null,450,1.2638,1.2699,1.2797000000000001,1.2883,1.2981,null,null,null,null,null,450]
[null,500,1.2421,1.2463,1.2532000000000001,1.2573000000000001,1.2621,1.2421,1.2463,1.2532000000000001,1.2573000000000001,1.2621,500,null,500,1.2543,1.2621,1.2744,1.2853000000000001,1.2976000000000001,null,null,null,null,null,500]
[null,600,1.2358,1.2412000000000001,1.2499,1.2543,1.2594000000000001,1.2358,1.2412000000000001,1.2499,1.2543,1.2594000000000001,600,null,600,1.2354000000000001,1.2463,1.2638,1.2791999999999999,1.2967,null,null,null,null,null,600]
[null,750,1.2262999999999999,1.2334000000000001,1.2447999999999999,1.2497,1.2553000000000001,1.2262999999999999,1.2334000000000001,1.2447999999999999,1.2497,1.2553000000000001,750,null,750,1.2069000000000001,1.2226999999999999,1.2479,1.27,1.2952999999999999,null,null,null,null,null,750]
[]
[null,null,"KORALUX RONDO CLASSIC",null,null,null,null,"KORALUX RONDO CLASSIC - M",null,null,null,null,null,null,null,"KORALUX RONDO CLASSIC",null,null,null,null,"KORALUX RONDO CLASSIC - M"]
[null,"Délka L","Výška H [mm]",null,null,null,null,"Výška H [mm]",null,null,null,null,"Délka L",null,"Délka L","Výška H [mm]",null,null,null,null,"Výška H [mm]",null,null,null,null,"Délka L"]
[null,"[mm]",700,900,1220,1500,1820,700,900,1220,1500,1820,"[mm]",null,"[mm]",700,900,1220,1500,1820,700,900,1220,1500,1820,"[mm]"]
[null,450,{"$f":"IF(logic!$D$98=1,C180,C216)","v":255},{"$f":"IF(logic!$D$98=1,D180,D216)","v":333},{"$f":"IF(logic!$D$98=1,E180,E216)","v":462},{"$f":"IF(logic!$D$98=1,F180,F216)","v":581},{"$f":"IF(logic!$D$98=1,G180,G216)","v":725},{"$f":"IF(logic!$D$98=1,H180,H216)","v":255},{"$f":"IF(logic!$D$98=1,I180,I216)","v":333},{"$f":"IF(logic!$D$98=1,J180,J216)","v":462},{"$f":"IF(logic!$D$98=1,K180,K216)","v":581},{"$f":"IF(logic!$D$98=1,L180,L216)","v":725},450,null,450,291,378,519,643,786,null,null,null,null,null,450]
[null,500,{"$f":"IF(logic!$D$98=1,C181,C217)","v":280},{"$f":"IF(logic!$D$98=1,D181,D217)","v":365},{"$f":"IF(logic!$D$98=1,E181,E217)","v":507},{"$f":"IF(logic!$D$98=1,F181,F217)","v":638},{"$f":"IF(logic!$D$98=1,G181,G217)","v":795},{"$f":"IF(logic!$D$98=1,H181,H217)","v":280},{"$f":"IF(logic!$D$98=1,I181,I217)","v":365},{"$f":"IF(logic!$D$98=1,J181,J217)","v":507},{"$f":"IF(logic!$D$98=1,K181,K217)","v":638},{"$f":"IF(logic!$D$98=1,L181,L217)","v":795},500,null,500,318,413,567,703,859,null,null,null,null,null,500]
[null,600,{"$f":"IF(logic!$D$98=1,C182,C218)","v":329},{"$f":"IF(logic!$D$98=1,D182,D218)","v":429},{"$f":"IF(logic!$D$98=1,E182,E218)","v":596},{"$f":"IF(logic!$D$98=1,F182,F218)","v":750},{"$f":"IF(logic!$D$98=1,G182,G218)","v":934},{"$f":"IF(logic!$D$98=1,H182,H218)","v":329},{"$f":"IF(logic!$D$98=1,I182,I218)","v":429},{"$f":"IF(logic!$D$98=1,J182,J218)","v":596},{"$f":"IF(logic!$D$98=1,K182,K218)","v":750},{"$f":"IF(logic!$D$98=1,L182,L218)","v":934},600,null,600,372,482,662,820,1003,null,null,null,null,null,600]
[null,750,{"$f":"IF(logic!$D$98=1,C183,C219)","v":400},{"$f":"IF(logic!$D$98=1,D183,D219)","v":522},{"$f":"IF(logic!$D$98=1,E183,E219)","v":726},{"$f":"IF(logic!$D$98=1,F183,F219)","v":913},{"$f":"IF(logic!$D$98=1,G183,G219)","v":1138},{"$f":"IF(logic!$D$98=1,H183,H219)","v":400},{"$f":"IF(logic!$D$98=1,I183,I219)","v":522},{"$f":"IF(logic!$D$98=1,J183,J219)","v":726},{"$f":"IF(logic!$D$98=1,K183,K219)","v":913},{"$f":"IF(logic!$D$98=1,L183,L219)","v":1138},750,null,750,449,583,799,991,1211,null,null,null,null,null,750]
[]
[null,null,"KORALUX RONDO CLASSIC",null,null,null,null,"KORALUX RONDO CLASSIC - M",null,null,null,null,null,null,null,"KORALUX RONDO CLASSIC",null,null,null,null,"KORALUX RONDO CLASSIC - M"]
[null,"Délka L","Výška H [mm]",null,null,null,null,"Výška H [mm]",null,null,null,null,"Délka L",null,"Délka L","Výška H [mm]",null,null,null,null,"Výška H [mm]",null,null,null,null,"Délka L"]
[null,"[mm]",700,900,1220,1500,1820,700,900,1220,1500,1820,"[mm]",null,"[mm]",700,900,1220,1500,1820,700,900,1220,1500,1820,"[mm]"]
[null,450,{"$f":"IF(logic!$D$98=1,C188,C224)","v":1.2225999999999999},{"$f":"IF(logic!$D$98=1,D188,D224)","v":1.2358},{"$f":"IF(logic!$D$98=1,E188,E224)","v":1.2567999999999999},{"$f":"IF(logic!$D$98=1,F188,F224)","v":1.2521},{"$f":"IF(logic!$D$98=1,G188,G224)","v":1.2421},{"$f":"IF(logic!$D$98=1,H188,H224)","v":1.2225999999999999},{"$f":"IF(logic!$D$98=1,I188,I224)","v":1.2358},{"$f":"IF(logic!$D$98=1,J188,J224)","v":1.2567999999999999},{"$f":"IF(logic!$D$98=1,K188,K224)","v":1.2521},{"$f":"IF(logic!$D$98=1,L188,L224)","v":1.2421},450,null,450,1.2765,1.2783,1.2810999999999999,1.2836000000000001,1.2864,null,null,null,null,null,450]
[null,500,{"$f":"IF(logic!$D$98=1,C189,C225)","v":1.2225999999999999},{"$f":"IF(logic!$D$98=1,D189,D225)","v":1.2346999999999999},{"$f":"IF(logic!$D$98=1,E189,E225)","v":1.254},{"$f":"IF(logic!$D$98=1,F189,F225)","v":1.2483},{"$f":"IF(logic!$D$98=1,G189,G225)","v":1.2393000000000001},{"$f":"IF(logic!$D$98=1,H189,H225)","v":1.2225999999999999},{"$f":"IF(logic!$D$98=1,I189,I225)","v":1.2346999999999999},{"$f":"IF(logic!$D$98=1,J189,J225)","v":1.254},{"$f":"IF(logic!$D$98=1,K189,K225)","v":1.2483},{"$f":"IF(logic!$D$98=1,L189,L225)","v":1.2393000000000001},500,null,500,1.2655000000000001,1.2690999999999999,1.2748999999999999,1.28,1.2859,null,null,null,null,null,500]
[null,600,{"$f":"IF(logic!$D$98=1,C190,C226)","v":1.2224999999999999},{"$f":"IF(logic!$D$98=1,D190,D226)","v":1.2324999999999999},{"$f":"IF(logic!$D$98=1,E190,E226)","v":1.2484},{"$f":"IF(logic!$D$98=1,F190,F226)","v":1.2407999999999999},{"$f":"IF(logic!$D$98=1,G190,G226)","v":1.2337},{"$f":"IF(logic!$D$98=1,H190,H226)","v":1.2224999999999999},{"$f":"IF(logic!$D$98=1,I190,I226)","v":1.2324999999999999},{"$f":"IF(logic!$D$98=1,J190,J226)","v":1.2484},{"$f":"IF(logic!$D$98=1,K190,K226)","v":1.2407999999999999},{"$f":"IF(logic!$D$98=1,L190,L226)","v":1.2337},600,null,600,1.2435,1.2508999999999999,1.2626999999999999,1.2729999999999999,1.2847999999999999,null,null,null,null,null,600]
[null,750,{"$f":"IF(logic!$D$98=1,C191,C227)","v":1.2223999999999999},{"$f":"IF(logic!$D$98=1,D191,D227)","v":1.2292000000000001},{"$f":"IF(logic!$D$98=1,E191,E227)","v":1.24},{"$f":"IF(logic!$D$98=1,F191,F227)","v":1.2294},{"$f":"IF(logic!$D$98=1,G191,G227)","v":1.2252000000000001},{"$f":"IF(logic!$D$98=1,H191,H227)","v":1.2223999999999999},{"$f":"IF(logic!$D$98=1,I191,I227)","v":1.2292000000000001},{"$f":"IF(logic!$D$98=1,J191,J227)","v":1.24},{"$f":"IF(logic!$D$98=1,K191,K227)","v":1.2294},{"$f":"IF(logic!$D$98=1,L191,L227)","v":1.2252000000000001},750,null,750,1.2104999999999999,1.2235,1.2442,1.2624,1.2830999999999999,null,null,null,null,null,750]
[]
[null,null,"KORALUX RONDO EXCLUSIVE - M",null,null,null,null,null,null,null,null,null,null,null,null,"KORALUX RONDO EXCLUSIVE - M"]
[null,"Délka L","Výška H [mm]",null,null,null,null,null,null,null,null,null,null,null,"Délka L","Výška H [mm]"]
[null,"[mm]",900,1220,1500,1820,null,null,null,null,null,null,null,null,"[mm]",900,1220,1500,1820]
[null,450,249,338,419,516,null,null,null,null,null,null,null,null,450]
[null,600,319,433,537,662,null,null,null,null,null,null,null,null,600]
[null,750,387,526,652,802,null,null,null,null,null,null,null,null,750]
[]
[null,null,"KORALUX RONDO EXCLUSIVE - M",null,null,null,null,null,null,null,null,null,null,null,null,"KORALUX RONDO EXCLUSIVE - M"]
[null,"Délka L","Výška H [mm]",null,null,null,null,null,null,null,null,null,null,null,"Délka L","Výška H [mm]"]
[null,"[mm]",900,1220,1500,1820,null,null,null,null,null,null,null,null,"[mm]",900,1220,1500,1820]
[null,450,1.2519,1.2768999999999999,1.266,1.2625,null,null,null,null,null,null,null,null,450]
[null,600,1.2522,1.2709999999999999,1.2606999999999999,1.2563,null,null,null,null,null,null,null,null,600]
[null,750,1.2525999999999999,1.2649999999999999,1.2553000000000001,1.25,null,null,null,null,null,null,null,null,750]
[]
[null,null,"KORALUX NEO",null,null,null,null,null,null,null,null,null,null,null,null,"KORALUX NEO"]
[null,"Délka L","Výška H [mm]",null,null,null,null,null,null,null,null,null,null,null,"Délka L","Výška H [mm]"]
[null,"[mm]",1095,1415,1695,null,null,null,null,null,null,null,null,null,"[mm]",1095,1415,1695]
[null,496,520,670,803,null,null,null,null,null,null,null,null,null,496]
[null,596,593,763,914,null,null,null,null,null,null,null,null,null,596]
[]
[null,null,"KORALUX NEO",null,null,null,null,null,null,null,null,null,null,null,null,"KORALUX NEO"]
[null,"Délka L","Výška H [mm]",null,null,null,null,null,null,null,null,null,null,null,"Délka L","Výška H [mm]"]
[null,"[mm]",1095,1415,1695,null,null,null,null,null,null,null,null,null,"[mm]",1095,1415,1695]
[null,496,1.3258000000000001,1.3312999999999999,1.3361000000000001,null,null,null,null,null,null,null,null,null,496]
[null,596,1.3258000000000001,1.3312999999999999,1.3361000000000001,null,null,null,null,null,null,null,null,null,596]
[]
[]
["české"]
[]
[null,null,"KORALUX LINEAR CLASSIC",null,null,null,null,"KORALUX LINEAR CLASSIC - M"]
[null,"Délka L","Výška H [mm]",null,null,null,null,"Výška H [mm]",null,null,null,null,"Délka L"]
[null,"[mm]",700,900,1220,1500,1820,700,900,1220,1500,1820,"[mm]"]
[null,450,267,348,479,597,735,267,348,479,597,735,450]
[null,500,292,380,523,652,803,292,380,523,652,803,500]
[null,600,341,443,611,761,937,341,443,611,761,937,600]
[null,750,412,535,737,919,1131,412,535,737,919,1131,750]
[]
[null,null,"KORALUX LINEAR CLASSIC",null,null,null,null,"KORALUX LINEAR CLASSIC - M"]
[null,"Délka L","Výška H [mm]",null,null,null,null,"Výška H [mm]",null,null,null,null,"Délka L"]
[null,"[mm]",700,900,1220,1500,1820,700,900,1220,1500,1820,"[mm]"]
[null,450,1.2309000000000001,1.2392000000000001,1.2524,1.2514000000000001,1.2503,1.2309000000000001,1.2392000000000001,1.2524,1.2514000000000001,1.2503,450]
[null,500,1.2293000000000001,1.2374000000000001,1.2504999999999999,1.2501,1.2496,1.2293000000000001,1.2374000000000001,1.2504999999999999,1.2501,1.2496,500]
[null,600,1.226,1.234,1.2467999999999999,1.2474000000000001,1.2481,1.226,1.234,1.2467999999999999,1.2474000000000001,1.2481,600]
[null,750,1.2211000000000001,1.2287999999999999,1.2412000000000001,1.2433000000000001,1.2458,1.2211000000000001,1.2287999999999999,1.2412000000000001,1.2433000000000001,1.2458,750]
[]
[null,null,"KORALUX RONDO CLASSIC",null,null,null,null,"KORALUX RONDO CLASSIC - M"]
[null,"Délka L","Výška H [mm]",null,null,null,null,"Výška H [mm]",null,null,null,null,"Délka L"]
[null,"[mm]",700,900,1220,1500,1820,700,900,1220,1500,1820,"[mm]"]
[null,450,267,348,479,597,735,267,348,479,597,735,450]
[null,500,292,380,523,652,803,292,380,523,652,803,500]
[null,600,341,443,611,761,937,341,443,611,761,937,600]
[null,750,412,535,737,919,1131,412,535,737,919,1131,750]
[]
[null,null,"KORALUX RONDO CLASSIC",null,null,null,null,"KORALUX RONDO CLASSIC - M"]
[null,"Délka L","Výška H [mm]",null,null,null,null,"Výška H [mm]",null,null,null,null,"Délka L"]
[null,"[mm]",700,900,1220,1500,1820,700,900,1220,1500,1820,"[mm]"]
[null,450,1.2309000000000001,1.2392000000000001,1.2524,1.2514000000000001,1.2503,1.2309000000000001,1.2392000000000001,1.2524,1.2514000000000001,1.2503,450]
[null,500,1.2293000000000001,1.2374000000000001,1.2504999999999999,1.2501,1.2496,1.2293000000000001,1.2374000000000001,1.2504999999999999,1.2501,1.2496,500]
[null,600,1.226,1.234,1.2467999999999999,1.2474000000000001,1.2481,1.226,1.234,1.2467999999999999,1.2474000000000001,1.2481,600]
[null,750,1.2211000000000001,1.2287999999999999,1.2412000000000001,1.2433000000000001,1.2458,1.2211000000000001,1.2287999999999999,1.2412000000000001,1.2433000000000001,1.2458,750]
[]
[]
[]
["NF"]
[]
[null,null,"KORALUX LINEAR CLASSIC",null,null,null,null,"KORALUX LINEAR CLASSIC - M"]
[null,"Délka L","Výška H [mm]",null,null,null,null,"Výška H [mm]",null,null,null,null,"Délka L"]
[null,"[mm]",700,900,1220,1500,1820,700,900,1220,1500,1820,"[mm]"]
[null,450,255,333,462,581,725,255,333,462,581,725,450]
[null,500,280,365,507,638,795,280,365,507,638,795,500]
[null,600,329,429,596,750,934,329,429,596,750,934,600]
[null,750,400,522,726,913,1138,400,522,726,913,1138,750]
[]
[null,null,"KORALUX LINEAR CLASSIC",null,null,null,null,"KORALUX LINEAR CLASSIC - M"]
[null,"Délka L","Výška H [mm]",null,null,null,null,"Výška H [mm]",null,null,null,null,"Délka L"]
[null,"[mm]",700,900,1220,1500,1820,700,900,1220,1500,1820,"[mm]"]
[null,450,1.2225999999999999,1.2358,1.2567999999999999,1.2521,1.2421,1.2225999999999999,1.2358,1.2567999999999999,1.2521,1.2421,450]
[null,500,1.2225999999999999,1.2346999999999999,1.254,1.2483,1.2393000000000001,1.2225999999999999,1.2346999999999999,1.254,1.2483,1.2393000000000001,500]
[null,600,1.2224999999999999,1.2324999999999999,1.2484,1.2407999999999999,1.2337,1.2224999999999999,1.2324999999999999,1.2484,1.2407999999999999,1.2337,600]
[null,750,1.2223999999999999,1.2292000000000001,1.24,1.2294,1.2252000000000001,1.2223999999999999,1.2292000000000001,1.24,1.2294,1.2252000000000001,750]
[]
[null,null,"KORALUX RONDO CLASSIC",null,null,null,null,"KORALUX RONDO CLASSIC - M"]
[null,"Délka L","Výška H [mm]",null,null,null,null,"Výška H [mm]",null,null,null,null,"Délka L"]
[null,"[mm]",700,900,1220,1500,1820,700,900,1220,1500,1820,"[mm]"]
[null,450,255,333,462,581,725,255,333,462,581,725,450]
[null,500,280,365,507,638,795,280,365,507,638,795,500]
[null,600,329,429,596,750,934,329,429,596,750,934,600]
[null,750,400,522,726,913,1138,400,522,726,913,1138,750]
[]
[null,null,"KORALUX RONDO CLASSIC",null,null,null,null,"KORALUX RONDO CLASSIC - M"]
[null,"Délka L","Výška H [mm]",null,null,null,null,"Výška H [mm]",null,null,null,null,"Délka L"]
[null,"[mm]",700,900,1220,1500,1820,700,900,1220,1500,1820,"[mm]"]
[null,450,1.2225999999999999,1.2358,1.2567999999999999,1.2521,1.2421,1.2225999999999999,1.2358,1.2567999999999999,1.2521,1.2421,450]
[null,500,1.2225999999999999,1.2346999999999999,1.254,1.2483,1.2393000000000001,1.2225999999999999,1.2346999999999999,1.254,1.2483,1.2393000000000001,500]
[null,600,1.2224999999999999,1.2324999999999999,1.2484,1.2407999999999999,1.2337,1.2224999999999999,1.2324999999999999,1.2484,1.2407999999999999,1.2337,600]
[null,750,1.2223999999999999,1.2292000000000001,1.24,1.2294,1.2252000000000001,1.2223999999999999,1.2292000000000001,1.24,1.2294,1.2252000000000001,750]

{"sheet":"logic","index":4,"n_rows":106,"n_cols":34,"rows_kept":106,"cut":false,"hidden":true,"merged":[[56,0,56,4],[57,1,57,2]]}
["Koralux_2024*"," "]
[null,null,null,null,null,null,"Popisky - úvodní strana",null,null,null,null,null,null,null,null,null,null,null,null,null,"lblZpusobPripojeniPopis"]
["Délka od",null,null,null,null,null,1,{"$f":"G3+1","v":2},{"$f":"H3+1","v":3},4,5,6,7,8,9,10,11,12,13,14,15,16,{"$f":"V3+1","v":17},{"$f":"W3+1","v":18},19,{"$f":"Y3+1","v":20},{"$f":"Z3+1","v":21},{"$f":"AA3+1","v":22},{"$f":"AB3+1","v":23},{"$f":"AC3+1","v":24},{"$f":"AD3+1","v":25},{"$f":"AE3+1","v":26},{"$f":"AF3+1","v":27}]
[1,{"$f":"VLOOKUP(A4,A5:B11,2,FALSE)","v":"wszystko"},null,null,null,null,6,{"$f":"VLOOKUP($G4,$G5:H16,H3,FALSE)","v":"Polski"},{"$f":"VLOOKUP($G4,$G5:I16,I3)","v":"wszystko"},{"$f":"VLOOKUP($G4,$G5:J16,J3)","v":"Wydajność cieplna wedlug EN 442"},{"$f":"VLOOKUP($G4,$G5:K16,K3)","v":"Wysokość"},{"$f":"VLOOKUP($G4,$G5:L16,L3)","v":"Długość"},{"$f":"VLOOKUP($G4,$G5:M16,M3)","v":"od"},{"$f":"VLOOKUP($G4,$G5:N16,N3)","v":"do"},{"$f":"VLOOKUP($G4,$G5:O16,O3)","v":"Wydajność cieplna "},{"$f":"VLOOKUP($G4,$G5:P16,P3)","v":"Temperatura:"},{"$f":"VLOOKUP($G4,$G5:Q16,Q3)","v":"Błędny spadek cieplny !!!"},{"$f":"VLOOKUP($G4,$G5:R16,R3)","v":"Wybór detaliczny"},{"$f":"VLOOKUP($G4,$G5:S16,S3)","v":"Zadanie wartości"},{"$f":"VLOOKUP($G4,$G5:T16,T3)","v":"Błędne zadanie wartości !!!"},{"$f":"VLOOKUP($G4,$G5:U16,U3)","v":"Sposób podłączenia"},{"$f":"VLOOKUP($G4,$G5:V16,V3)","v":"Zmiany techniczne zastrzeżone."},{"$f":"VLOOKUP($G4,$G5:W16,W3)","v":"Wprowadzene moce są platne tylko dla kraje:"},{"$f":"VLOOKUP($G4,$G5:X16,X3)","v":"France"},{"$f":"VLOOKUP($G4,$G5:Y16,Y3)","v":"Unité de chaleur:"},{"$f":"VLOOKUP($G4,$G5:Z16,Z3)","v":"dolne z dołu w dół"},{"$f":"VLOOKUP($G4,$G5:AA16,AA3)","v":"dwustronne z góry na dół"},{"$f":"VLOOKUP($G4,$G5:AB16,AB3)","v":"Wykonanie"},{"$f":"VLOOKUP($G4,$G5:AC16,AC3)","v":"Wykończenie powierzchni"},{"$f":"VLOOKUP($G4,$G5:AD16,AD3)","v":"FARBA"},{"$f":"VLOOKUP($G4,$G5:AE16,AE3)","v":"CHROM"},{"$f":"VLOOKUP($G4,$G5:AF18,AF3)","v":"System metryczny"},{"$f":"VLOOKUP($G4,$G5:AG18,AG3)","v":"System imperialny"}]
[1,{"$f":"$I$4","v":"wszystko"},"vše",null,null,null,1,"Česky","vše","Tepelné výkony podle EN 442","Výška","Délka","od","do","Tepelný výkon","Teplota:","Chybný teplotní spád !!!","Detailní výběr","Zadání hodnot","Chybně zadané hodnoty !!!","Způsob připojení","Technické změny vyhrazeny.","Uvedené výkony jsou platné pouze pro zemi:","Česká republika","Jednotka výkonu:","spodní zdola dolů","úhlopříčné shora","Provedení","Povrchová úprava","BARVA","CHROM","Metrický systém","Imperiální systém"]
[2,{"$f":"IF($K$64=2,C6/$M$64,C6)","v":400},400,null,null,null,2,"English","all","Heat outputs according to EN 442","Height","Length","from","up to","Heat output","Temperature:","Wrong temperature gradient !!!","Detailed selection","Select conditions","Wrong values input !!!","Type of connection","Technical changes reserved.","The quoted outputs are valid only for the country:","UK, USA","Heat unit:","bottom connection","double-sided from the top down","Version","Surface finish","Coating","CHROME","Metric system","Imperial system"]
[3,{"$f":"IF($K$64=2,C7/$M$64,C7)","v":450},450,null,null,null,3,"Français","tout","Puissances thermiques selon EN 442","Hauteur","Longueur","de","à","Puissance thermique","Température:","Fausse cadence de température","Choix en détail","Introduction des valeurs","Valeurs mal introduites","Mode de raccordement","Tous droits de modification technique réservés.","Puissance dénommées sont valables pour le pays :","Deutschland, Österreich","Unité de puissance :","inférieur, du bes vers le bas","bilatéral de haut","Réalisation","Traitement de la surface","COULEUR","CHROME","Le système métrique","Le système impérial"]
[4,{"$f":"IF($K$64=2,C8/$M$64,C8)","v":500},500,null,null,null,4,"Deutsch","alles","Wärmeleistungen nach EN 442","Bauhöhe","Baulänge","von","bis","Wärmeleistungen","Temperatur:","Falscher Temperaturgradient","Detailauswahl","Auswahlkriterien","Falsche Dateneingabe !!!","Anschlussart an das Heizsystem","Technische Änderungen vorbehalten.","Die angegebenen Leistungen sind gültig nur für das Land:","Россия","Тепловая единица:","unten zweiseitig","beidseitig von oben nach unten","Ausführung","Oberflächenbehandlung","BESCHICHTUNG","CHROM","Metrisches System","Imperiales System"]
[5,{"$f":"IF($K$64=2,C9/$M$64,C9)","v":600},600,null,null,null,5,"Русский","всё","Тепловые мощности согл. EN 442","Высота","Длина","от","до","Тепловая мощность","Температура","Неправильный перепад температуры","Тип радиатора","Параметры","Неправильно заданые значения!!!","Способ подключения","Призводитель оставляет за собой право на изменения.","Данные действительны только для","Polska","Jednostka ciepła:","нижнее снизу вниз","двустороннее сверху вниз","Исполнение      ","Oтделка поверности","КРАСКА","ХРОМ","Метрическая система","Имперская система"]
[6,{"$f":"IF($K$64=2,C10/$M$64,C10)","v":750},750,null,null,null,6,"Polski","wszystko","Wydajność cieplna wedlug EN 442","Wysokość","Długość","od","do","Wydajność cieplna ","Temperatura:","Błędny spadek cieplny !!!","Wybór detaliczny","Zadanie wartości","Błędne zadanie wartości !!!","Sposób podłączenia","Zmiany techniczne zastrzeżone.","Wprowadzene moce są platne tylko dla kraje:","France","Unité de chaleur:","dolne z dołu w dół","dwustronne z góry na dół","Wykonanie","Wykończenie powierzchni","FARBA","CHROM","System metryczny","System imperialny"]
[7,null,null,null,null,null,7,"Magyar","mind","Hőteljesítmény az EN 442 szerint","Magasság","Hossz","–től","–ig","Hőteljesítmény","Hőmérséklet:","Hibás hőmérséklet csökkenés !!!","Részletes kiválasztás","Értékek megadása","Hibásan megadott értékek !!!","Csatlakozási mód","Műszaki adatok megváltoztatásának joga fenntartva.","A feltüntetett teljesítmények csak a következő országra érvényesek:","Magyarország","Hőegység:","alsó alsó lefelé","átlósan felülről","Végrehajtás","Felületkezelés","SZÍN","CHROME","Metrikus rendszer","Birodalmi rendszer"]
[null,null,null,null,null,null,8,"Svenska","alla","Värmeavgivning enligt EN 442","Höjd","Längd","från","till","Värmeavgivning ","Temperatur:","Fel temperaturfall !!!","Detaljerat urval","välj temperaturfall","Fel värde inskrivet !!!","Typ av anslutning","Med reservation för tekniska förändringar.","Nämnda effekter är giltiga endast i landet:","Sverige","Värme enhet:","Anslutning botten ","Dubbelsidig från topp och ner","Version","Ytfinish","FÄRGe","Krom","Metriska systemet","Imperiala systemet"]
["Délka do",null,null,null,null,null,9,"Română","toate","Puteri termice conform EN442","Înălţime","Lungime","de la","până la","Putere termică","Temperatură:","Gradient de temperatură greşit !!!","Căutare avansată","Selectaţi condiţiile","Parametrii greşiţi de intrare","Metoda conexiunii","Producătorul îşi rezervă dreptul de a efectua modificări tehnice","Puterile termice menţionate sunt valabile pentru:","România","Unitatea de putere:","de jos în jos","diagonala de sus","Versiune","Finisajul suprafeţei","CULOARE","CROMAT","Sistem metric","Sistem imperial"]
[1,{"$f":"VLOOKUP(A14,A15:B21,2,FALSE)","v":"wszystko"},null,null,null,null,10,"Български","всички","Топлинни мощности според ЕН 442","Височина","Дължина","от","до","Топлинна мощност ","Температура:","Грешно температурно спадане !!!","Детайлен избор","Въвеждане на стойности","Грешно въведени стойности !!!","Начин на свързване","Право на технически промени.","Посочените мощности са валидни само за държава:","България","Мярна единица за мощност:","долно отдолу долу","двустранно отгоре долу","Изпълнение","Повърхностно покритие","ЦВЯТ","ХРОМ","Метрична система","Имперска система"]
[1,{"$f":"$I$4","v":"wszystko"},"vše",null,null,null,11,"Nederlands","alles","Warmteafgiftes volgens EN 442","Hoogte","Lengte","van","tot","Warmteafgifte","Temperatuur:","Verkeerde temperatuur verhouding !!!","Gedetailleerde selectie","Ingeven van waarden","Waarden foutief ingegeven !!!","Type aansluiting","Het recht blijft behouden op technische wijzigingen.","De weergegeven vermogens zijn geldig in volgende landen:","België / Nederland","Eenheid van vermogen:","onderaansluiting","dubbelzijdig van bovenaan","Versie","Afwerkingslaag","KLEUR","CHROOM","Metrisch systeem","Imperiaal systeem"]
[2,{"$f":"IF($K$64=2,C16/$M$64,C16)","v":400},400,null,null,null,12,"Norsk","alle","Effekt avgivelse iht EN442","Høyde","Lengde","fra","til","Effekt avgivelse","Temperatur :","Feil temperatur fall !!!","Detaljert valg","velg temperaturfall","Feil verdi innskrevet !!!","Type anslutning","Med reservasjon for tekniske endringer.","Nevnte effekter er gyldig bare i Norge.","Norge","Varme enhet:","Anslutning fra bunnen","Dobbelsidig fra topp og ned","versjon","Overflatebehandling","FARGE","Krom","Metrisk system","Imperialistisk system"]
[3,{"$f":"IF($K$64=2,C17/$M$64,C17)","v":450},450]
[4,{"$f":"IF($K$64=2,C18/$M$64,C18)","v":500},500]
[5,{"$f":"IF($K$64=2,C19/$M$64,C19)","v":600},600]
[6,{"$f":"IF($K$64=2,C20/$M$64,C20)","v":750},750]
[7]
[null,null,null,null,null,null,"Popisky - databáze",null,"lblPridatdoDB",null,"cmdOK",null,"lblZobrazitDatabazi","lblZpet","lblExportDatabaze"]
["Výška od",null,null,null,null,null,{"$f":"G3","v":1},{"$f":"G23+1","v":2},{"$f":"H23+1","v":3},4,5,6,7,8,9,10,11,12,13,14,15,16,{"$f":"V23+1","v":17},{"$f":"W23+1","v":18},{"$f":"X23+1","v":19},{"$f":"Y23+1","v":20},{"$f":"Z23+1","v":21},{"$f":"AA23+1","v":22},{"$f":"AB23+1","v":23},{"$f":"AC23+1","v":24},{"$f":"AD23+1","v":25},{"$f":"AE23+1","v":26},{"$f":"AF23+1","v":27},{"$f":"AG23+1","v":28}]
[1,{"$f":"VLOOKUP(A24,A25:B31,2,FALSE)","v":"wszystko"},null,null,null,null,{"$f":"$G$4","v":6},{"$f":"VLOOKUP($G24,$G25:H38,H23)","v":"Polski"},{"$f":"VLOOKUP($G24,$G25:I38,I23)","v":"Dołożyć do wykazu"},{"$f":"VLOOKUP($G24,$G25:J38,J23)","v":"Mam faktycznie stuszować wykaz??"},{"$f":"VLOOKUP($G24,$G25:K38,K23)","v":"OK"},{"$f":"VLOOKUP($G24,$G25:L38,L23)","v":"Liczba zapisów w wykazie:"},{"$f":"VLOOKUP($G24,$G25:M38,M23)","v":"Wyobrazić wykaz"},{"$f":"VLOOKUP($G24,$G25:N38,N23)","v":"Z powrotem na wybór"},{"$f":"VLOOKUP($G24,$G25:O38,O23)","v":"Eksport wykazu"},{"$f":"VLOOKUP($G24,$G25:P38,P23)","v":"Cena (PLN)"},{"$f":"VLOOKUP($G24,$G25:Q38,Q23)","v":"Num"},{"$f":"VLOOKUP($G24,$G25:R38,R23)","v":"Model"},{"$f":"VLOOKUP($G24,$G25:S38,S23)","v":"Numer zamówienia"},{"$f":"VLOOKUP($G24,$G25:T38,T23)","v":"Typ"},{"$f":"VLOOKUP($G24,$G25:U38,U23)&\" [\"&$O$64&\"]\"","v":"Wysokość [mm] [mm]"},{"$f":"VLOOKUP($G24,$G25:V38,V23)&\" [\"&$O$64&\"]\"","v":"Długość [mm] [mm]"},{"$f":"VLOOKUP($G24,$G25:W38,W23)","v":"t1"},{"$f":"VLOOKUP($G24,$G25:X38,X23)","v":"t2"},{"$f":"VLOOKUP($G24,$G25:Y38,Y23)","v":"ti"},{"$f":"VLOOKUP($G24,$G25:Z38,Z23)","v":"Wydajność cieplna"},{"$f":"VLOOKUP($G24,$G25:AA38,AA23)","v":"Notatka"},{"$f":"VLOOKUP($G24,$G25:AB38,AB23)","v":"Identyfikacja:"},{"$f":"VLOOKUP($G24,$G25:AC38,AC23)","v":"Wybrany zakres nie zawiera prawiedlowe dane!!!"},{"$f":"VLOOKUP($G24,$G25:AD38,AD23)","v":"OK"},{"$f":"VLOOKUP($G24,$G25:AE39,AE23)","v":0},{"$f":"VLOOKUP($G24,$G25:AF39,AF23)","v":0},{"$f":"VLOOKUP($G24,$G25:AG39,AG23)","v":0},{"$f":"VLOOKUP($G24,$G25:AH39,AH23)","v":0}]
[1,{"$f":"$I$4","v":"wszystko"},"vše",null,null,null,1,"Česky","Přidat do databáze","Mám opravdu smazat databázi?","OK","Počet záznamů v databázi:","Zobrazit databázi","Zpět na výběr","Export databáze","Cena (Kč)","Číslo","Model","Objednací číslo","Typ","Výška [mm]","Délka [mm]","t1","t2","ti","Tepelný výkon","Poznámka","Identifikace:","Vybraná oblast neobsahuje správná data!!!","OK"]
[2,{"$f":"IF($K$64=2,C26/$M$64,C26)","v":700},700,null,null,null,2,"English","Add into database","Shall the database really be deleted?","OK","No. of articles in database:","Display the database","Back to menu","Database export","Price (€)","No.","Model","Order No.","TYPE","Height [mm]","Length [mm]","t1","t2","ti","Heat output","Note","Identification:","Selected area does not content right data !!!","OK"]
[3,{"$f":"IF($K$64=2,C27/$M$64,C27)","v":900},900,null,null,null,3,"Français","Ajouter dans la base de données","Etes-vous sur d´annulation de la base de données?","OK","No. d´inscriptions dans la base de données:","Montrer la base de données","Retour au choix","Export de la base de données","Prix ( )","No.","Modèle","No. De commande","TYPE","Hauteur [mm]","Longueur [mm]","t1","t2","ti","Puissance thermique","Nota","Identification:","La zone marquée ne contient pas de données correctes!!!","OK"]
[4,{"$f":"IF($K$64=2,C28/$M$64,C28)","v":1220},1220,null,null,null,4,"Deutsch","In die Database hinzufügen","Soll die Database wirklich gelöscht werden?","OK","Anzahl der Aufnahmen in der Database:","Database abbilden","Zurück zur Auswahl","Database exportieren","Preis (€)","No.","Modell","Bestellnummer","TYP","Bauhöhe [mm]","Baulänge [mm]","t1","t2","ti","Wärmeleistungen","Bemerkung","Identifikation:","Ausgewählter Bereich beinhaltet nicht die richtigen Daten !!!","OK"]
[5,{"$f":"IF($K$64=2,C29/$M$64,C29)","v":1500},1500,null,null,null,5,"Русский","Добавить в базу данных","Хотите сбросить базу данных?","OK","Количество записей в базе данный:","Посмотреть базу данных","Вернуться на выбор","Перевод избранных типов","Цена (€)","Номер","Модель","Код изделия","Тип","Высота [mm]","Длина [mm]","Т1","Т2","ti","Тепловая мощность","Примечание","Идентификация:","В выбранной области имеется неправильная информация!!!","OK"]
[6,{"$f":"IF($K$64=2,C30/$M$64,C30)","v":1820},1820,null,null,null,6,"Polski","Dołożyć do wykazu","Mam faktycznie stuszować wykaz??","OK","Liczba zapisów w wykazie:","Wyobrazić wykaz","Z powrotem na wybór","Eksport wykazu","Cena (PLN)","Num","Model","Numer zamówienia","Typ","Wysokość [mm]","Długość [mm]","t1","t2","ti","Wydajność cieplna","Notatka","Identyfikacja:","Wybrany zakres nie zawiera prawiedlowe dane!!!","OK"]
[7,null,null,null,null,null,7,"Magyar","Adatbázisba küldés","Valóban törölni az adatbázist?","OK","Azt adatbázis tételeinek száma:","Adatbázis megjelenítése","Vissza a kiválasztáshoz","Adatbázis exportja","Ár ( )","Sz.","Modell","Megrend. szám","Típus","Magasság [mm]","Hosszúság [mm]","t1","t2","ti","Hőteljesítmény","Megjegyzés","Azonosító:","A kiválasztott terület nem tartalmaz valós adatokat !!!","OK"]
[null,null,null,null,null,null,8,"Svenska","Lägg till i databasen","Ska du verkligen tömma databasen?","OK","Antal artiklar i databasen:","Visa databasen","Tillbaka till meny","Exportera värde","Pris ( )","Nr.","Model","Order Nr.","TYP","Höjd [mm]","Längd [mm]","t1","t2","ti","Värmeavgivning","Notering  ","Identifikation:","Vald ruta inehåller inte rätt data !!!","OK"]
["Výška do",null,null,null,null,null,9,"Română","Adăugare la baza de date","Sigur doriţi să ştergeţi baza de date?","OK","Nr. articolelor din baza de date","Afişare bază de date","Înapoi la meniu","Exportare bază de date","Preţ ( )","Nr.","Model.","Comanda nr.","Tip","Înălţime [mm]","Lungime [mm]","t1","t2","ti ","Putere termică","Notă","Identificare:","Câmpul selectat nu conţine date corecte !!","OK"]
[1,{"$f":"VLOOKUP(A34,A35:B41,2,FALSE)","v":"wszystko"},null,null,null,null,10,"Български","Допълни в базата данни","Наистина ли да изтрия базата данни?","OK","Брой записвания в база данни:","Покажи база данни","Обратно към избор","Експорт на база данни","Цена ( )","Номер","Модел","Номер за поръчка","Тип","Височина [mm]","Дължина [mm]","t1","t2","ti","Топлинна мощност","Забележка","Идентификация:","Избраната област не съдържа правилни данни!!!","OK"]
[1,{"$f":"$I$4","v":"wszystko"},"vše",null,null,null,11,"Nederlands","Toevoegen in database","Bent u zeker om de database te verwijderen ?","OK","Aantal artikelen in de database:","Toon de database","Terug naar menu","Exporteer database","Prijs ( )","Nr.","Model","Bestelnummer","Type","Hoogte [mm]","Lengte [mm]","t1","t2","ti","Warmteafgifte","Opmerking","Identificatie:","De selectie heeft geen correcte data !!!","OK"]
[2,{"$f":"IF($K$64=2,C36/$M$64,C36)","v":700},700,null,null,null,12,"Norsk","Legg til i databasen","Ønsker virkelig du å tømme databasen ?","OK","Antal artikler i databasen","Vis databasen","Tilbake til menyen","Eksporterte verdier","Pris ( )","Nr.","Modell","Ordre nr. ","Type","Høyde [mm]","Lengde [mm]","t1","t2","ti","Effekt avgivelse","Tekst","Identifikasjon :","Valgt celle inneholder feil data  !!!","OK"]
[3,{"$f":"IF($K$64=2,C37/$M$64,C37)","v":900},900,null,null,null,13]
[4,{"$f":"IF($K$64=2,C38/$M$64,C38)","v":1220},1220,null,null,null,14]
[5,{"$f":"IF($K$64=2,C39/$M$64,C39)","v":1500},1500]
[6,{"$f":"IF($K$64=2,C40/$M$64,C40)","v":1820},1820]
[7]
[null,null,{"$f":"logic!$L$4","v":"Długość"},null,null,null,"Přidávací a mazací formulář"]
[null,null,null,null,null,null,null,null,"lblNadpis",null,"lblTypPopis","lblVýškaPopis","lblDélka Popis","lblVýkonPopis","lblKodArtikluPopis","lblPoznamka","cmdZrusit","cmdVlozit","cmdNelze","lblZapisProveden","cmdVymazat",null,"lblVymaz","lblVymazDatabaze"]
[null,null,null,null,null,null,{"$f":"G23","v":1},{"$f":"G44+1","v":2},{"$f":"H44+1","v":3},{"$f":"I44+1","v":4},{"$f":"J44+1","v":5},{"$f":"K44+1","v":6},{"$f":"L44+1","v":7},{"$f":"M44+1","v":8},{"$f":"N44+1","v":9},{"$f":"O44+1","v":10},{"$f":"P44+1","v":11},{"$f":"Q44+1","v":12},{"$f":"R44+1","v":13},{"$f":"S44+1","v":14},{"$f":"T44+1","v":15},{"$f":"U44+1","v":16},{"$f":"V44+1","v":17},{"$f":"W44+1","v":18},{"$f":"X44+1","v":19},{"$f":"Y44+1","v":20},{"$f":"Z44+1","v":21},{"$f":"AA44+1","v":22}]
[{"$f":"$K$64","v":1},{"$f":"VLOOKUP(A45,A46:B47,2,FALSE)","v":"W"},{"$f":"VLOOKUP(A45,A46:C47,3,FALSE)","v":"W"},{"$f":"VLOOKUP(A45,A46:D47,4,FALSE)","v":1},{"$f":"VLOOKUP(B45,B46:E47,4,FALSE)","v":"[W]"},null,{"$f":"$G$4","v":6},{"$f":"VLOOKUP($G45,$G46:H59,H44)","v":"Polski"},{"$f":"VLOOKUP($G45,$G46:I59,I44)","v":"Dorzucanie pozycje do wykazu"},{"$f":"VLOOKUP($G45,$G46:J59,J44)","v":"Model"},{"$f":"VLOOKUP($G45,$G46:K59,K44)","v":"Typ"},{"$f":"VLOOKUP($G45,$G46:L59,L44)&\" [\"&$O$64&\"]\"","v":"Wysokość [mm] [mm]"},{"$f":"VLOOKUP($G45,$G46:M59,M44)&\" [\"&$O$64&\"]\"","v":"Długość [mm] [mm]"},{"$f":"VLOOKUP($G45,$G46:N59,N44)","v":"Wydajność cieplna "},{"$f":"VLOOKUP($G45,$G46:O59,O44)","v":"Numer zamówienia"},{"$f":"VLOOKUP($G45,$G46:P59,P44)","v":"Notatka (maksymalnie 20 znaków)"},{"$f":"VLOOKUP($G45,$G46:Q59,Q44)","v":"Anulować"},{"$f":"VLOOKUP($G45,$G46:R59,R44)","v":"Włożyć"},{"$f":"VLOOKUP($G45,$G46:S59,S44)","v":"Formularz nie można w ten sposób zamknąć!!!"},{"$f":"VLOOKUP($G45,$G46:T59,T44)","v":"Zapis dokonan z powodzeniem"},{"$f":"VLOOKUP($G45,$G46:U59,U44)","v":"Wykreślać"},{"$f":"VLOOKUP($G45,$G46:V59,V44)","v":"Wykaz"},{"$f":"VLOOKUP($G45,$G46:W59,W44)","v":"Wykreślać pozycje z wykazu"},{"$f":"VLOOKUP($G45,$G46:X59,X44)","v":"Wykreślić z wykazu"},{"$f":"VLOOKUP($G45,$G46:Y59,Y44)","v":0},{"$f":"VLOOKUP($G45,$G46:Z59,Z44)","v":0},{"$f":"VLOOKUP($G45,$G46:AA59,AA44)","v":0},{"$f":"VLOOKUP($G45,$G46:AB59,AB44)","v":0}]
[1,"W","W",1,"[W]",null,1,"Česky","Přidání položky do databáze","Model","Typ","Výška [mm]","Délka [mm]",{"$f":"O5","v":"Tepelný výkon"},"Objednací číslo","Poznámka (maximum 20 znaků):","Zrušit","Vložit","Formulář nelze zavřít tímto způsobem !!!","Zápis úspěšně proveden","Vymazat","Databáze","Výmaz položky z databáze","Výmaz databáze"]
[2,"BTU","BTU",3.4119999999999999,"[BTU]",null,2,"English","Add item into the database","Model","Type","Height [mm]","Length [mm]","Heat output","Order No.","Note (up to 20 characters)","Cancel","Add","The form cannot be closed in this way !!!","Entry successfully processed ","Delete","Database","Delete an item from the database","Database erase"]
[null,null,null,null,null,null,3,"Français","Adjonction d´un article dans la base de données","Modèle","Type","Hauteur [mm]","Longueur [mm]","Puissance thermique","Indication de l´article","Note (20 caractères au maximum)","Annuler","Insérer","Il n´est pas possible de fermer le formulaire de cette façon !!!","Inscription réalisée avec succès","Effacer","Base de données","Effacement d´un article","Effacer la base de données"]
[null,null,null,null,null,null,4,"Deutsch","Den Posten in die Database hinzufügen","Modell","Typ","Bauhöhe [mm]","Baulänge [mm]","Wärmeleistungen","Bestellnummer","Bemerkung (max. 20 Zeichen)","Aufheben","Einfügen","Das Formular kann nicht auf diese Art geschlossen werden !!!","Eingabe erfolgreich durchgeführt","Löschen","Database","Den Posten aus der Database löschen","Database löschen"]
[1,{"$f":"VLOOKUP(A50,A51:B52,2,FALSE)","v":"dolne z dołu w dół"},null,null,null,null,5,"Русский"," Добавить в базу данных","Модель","Тип","Высота [mm]","Длина [mm]","Тепловая мощность","Код изделия","Примечание (макс 20 знаков)","Отменить","Добавить","Документ не возможно закрыть в таком формате!!!","Запись успешно сделана","Смазать","База данных","Исключение позиции из базы данных","Сброс базы данных"]
[1,{"$f":"Z4","v":"dolne z dołu w dół"},null,null,null,null,6,"Polski","Dorzucanie pozycje do wykazu","Model","Typ","Wysokość [mm]","Długość [mm]","Wydajność cieplna ","Numer zamówienia","Notatka (maksymalnie 20 znaków)","Anulować","Włożyć","Formularz nie można w ten sposób zamknąć!!!","Zapis dokonan z powodzeniem","Wykreślać","Wykaz","Wykreślać pozycje z wykazu","Wykreślić z wykazu"]
[2,{"$f":"AA4","v":"dwustronne z góry na dół"},null,null,null,null,7,"Magyar","Tétel hozzáadása az adatbázishoz","Modell","Típus","Magasság [mm]","Hosszúság [mm]","Hőteljesítmény","Megrendelési szám","Megjegyzés (maximum 20 karakter):","Mégse","Beszúr","Így nem lehet bezárni a programot !!!","A beírás sikeres volt","Töröl","Adatbázis","Tétel törlése az adatbázisból","Adatbázis törlése"]
[null,null,null,null,null,null,8,"Svenska","Lägg objekt i databasen","Model","Typ","Höjd [mm]","Längd [mm]","Värmeavgivning ","Order Nr.","Notering (upp till 20 tecken)","Ångra","Lägg till","Formuläret kan inte stängas på detta sätt!!!","Invärde korrekta","Ta bort","Databas","Ta bort ett objekt från databas","Radera data"]
[null,null,null,null,null,null,9,"Română","Adăugare articol în baza de date","Model","Tip","Înălţime [mm]","Lungime [mm]",{"$f":"O13","v":"Putere termică"},"Comanda nr.","Observaţii (până la 20 de caractere)","Anulare","Adăugare ","Fereastra nu poate fi închisă în acest  mod !!!","Valorile de intrare au fost procesate cu succes","Şterge","Bază de date","Ştergerea unui articol din baza de date","Ştergere baza de date"]
[null,null,null,null,null,null,10,"Български","Допълване на позиции в базата данни","Модел","Тип","Височина [mm]","Дължина [mm]",{"$f":"O14","v":"Топлинна мощност "},"Номер за поръчка","Забележка (максимално 20 знака):","Анулирай","Въведи","Формулярът не може да се затвори по този начин !!!","Успешно извършено записване","Изтрий","База данни","Изтрий позиции в база данни","Изтрий база данни"]
[null,null,null,null,null,null,11,"Nederlands","Toevoegen van artikel in database","Model","Type","Hoogte [mm]","Lengte [mm]","Warmteafgifte","Bestelnummer","Opmerking (maximum 20 karakters)","Annuleren","Toevoegen","Afsluiten van het document niet mogelijk !!!","Ingave succesvol beëindigd","Verwijder","Database","Verwijder een artikel uit de database","Verwijder de database"]
["Číslování verzí",null,null,null,null,null,12,"Norsk","Legg produktet i databasen","Modell","Type","Høyde [mm]","Lengde [mm]","Effekt avgivelse","Ordre nr. ","Tekst (maks 20 tegn)","Angre","Legg til","Skjemaet kan ikke lukkes på denne måten!!!","Inndata er korrekt","Ta bort","Database","Ta bort en enhet fra databasen","Slett inndata"]
["kód země","číslo verze",null,"datum sort.","makra",null,13]
["CZ","1","02","01/2017","M",null,14]
[]
["AT",1,"01",null,"M"]
["CZ",2,"02"]
["DE",3,"03"]
["PL",4,"04",null,null,null,null,null,null,null,1,{"$f":"VLOOKUP(K64,K65:L66,2,FALSE)","v":"System metryczny"},{"$f":"VLOOKUP(K64,K65:M66,3,FALSE)","v":1},{"$f":"VLOOKUP(L64,L65:N66,3,FALSE)","v":"Celsius"},{"$f":"VLOOKUP(M64,M65:O66,3,FALSE)","v":"mm"}]
["UA",5,"05",null,null,null,null,null,null,null,1,{"$f":"$AF$4","v":"System metryczny"},1,"Celsius","mm"]
["RU",null,"06",null,{"$f":"A59&\" OTT \"&B59&\".\"&C59&\"-\"&MID(D59,1,2)&\"/\"&MID(D59,6,2)&\" \"&E59","v":"CZ OTT 1.02-01/17 M"},null,null,null,null,null,2,{"$f":"$AG$4","v":"System imperialny"},25.4,"Fahrenheit","inch"]
["HU",null,"07"]
["SW",null,"08"]
["RO",null,"09"]
["CL",null,"10"]
[]
[]
[]
["KLMM",{"$f":"VLOOKUP(model_zdroj,A75:B90,2,FALSE)","v":"KORALUX LINEAR MAX - M"},null,null,null,"KORALUX STANDARD",null,null,{"$f":"VLOOKUP(F74,F75:I89,4,FALSE)","v":"KSC"}]
["KSC","KORALUX STANDARD",null,null,null,"KORALUX STANDARD",null,null,{"$f":"A75","v":"KSC"}]
["KLC","KORALUX LINEAR CLASSIC",null,null,null,"KORALUX LINEAR CLASSIC",null,null,"KLC"]
["KLCM","KORALUX LINEAR CLASSIC - M",null,null,null,"KORALUX LINEAR CLASSIC - M",null,null,"KLCM"]
["KRC","KORALUX RONDO CLASSIC",null,null,null,"KORALUX RONDO CLASSIC",null,null,"KRC"]
["KRCM","KORALUX RONDO CLASSIC - M",null,null,null,"KORALUX RONDO CLASSIC - M",null,null,"KRCM"]
["KLT","KORALUX LINEAR COMFORT",null,null,null,"KORALUX LINEAR COMFORT",null,null,"KLT"]
["KLTM","KORALUX LINEAR COMFORT - M",null,null,null,"KORALUX LINEAR COMFORT - M",null,null,"KLTM"]
["KRT","KORALUX RONDO COMFORT",null,null,null,"KORALUX RONDO COMFORT",null,null,"KRT"]
["KRTM","KORALUX RONDO COMFORT - M",null,null,null,"KORALUX RONDO COMFORT - M",null,null,"KRTM"]
["KLM","KORALUX LINEAR MAX",null,null,null,"KORALUX LINEAR MAX",null,null,"KLM"]
["KLMM","KORALUX LINEAR MAX - M",null,null,null,"KORALUX LINEAR MAX - M",null,null,"KLMM"]
["KRM","KORALUX RONDO MAX",null,null,null,"KORALUX RONDO MAX",null,null,"KRM"]
["KRMM","KORALUX RONDO MAX - M",null,null,null,"KORALUX RONDO MAX - M",null,null,"KRMM"]
["KLXM","KORALUX LINEAR EXCLUSIVE - M",null,null,null,"KORALUX LINEAR EXCLUSIVE - M",null,null,"KLXM"]
["KRXM","KORALUX RONDO EXCLUSIVE - M",null,null,null,"KORALUX RONDO EXCLUSIVE - M",null,null,"KRXM"]
["KLN","KORALUX NEO",null,null,null,"KORALUX NEO",null,null,"KLN"]
[]
[]
[]
[]
[]
[]
[null,null,null,"VÝKONY"]
[1,{"$f":"VLOOKUP(A98,A99:B100,2,FALSE)","v":"LINEAR"},null,2,{"$f":"VLOOKUP(D98,D99:E100,2,FALSE)","v":"NF"}]
[1,"LINEAR",null,1,"České"]
[2,"RONDO",null,2,"NF"]
[]
[]
[]
[1,{"$f":"VLOOKUP(A104,A105:B106,2,FALSE)","v":"FARBA"}]
[1,{"$f":"AD4","v":"FARBA"}]
[2,{"$f":"AE4","v":"CHROM"}]